{"text_format":"1","workbook":"xlsx","n_sheets":4,"sheets":["2017","Control Sheet","Source","Template"],"not_rendered":{"charts":0,"images":0,"macros":1,"external_links":0,"defined_names":1,"comments":0,"pivot_tables":0},"unopened":[],"bounds":{"document_bytes":16777216,"sheet_cells":100000,"rows_first":2000,"rows_last":500,"rows_between":2000,"halvings":0,"cell_chars":16384,"cell_head_chars":4096},"cells_cut":0,"cells_raw":0,"read":"whole","date_system":"1900"}

{"sheet":"2017","index":0,"n_rows":369,"n_cols":8,"rows_kept":369,"cut":false,"hidden":false,"merged":[]}
[null,null,null,null,null,null,null,{"$f":"'Control Sheet'!K5","v":"Yes"}]
[null,null,null,null,null,null,null,{"$f":"'Control Sheet'!K15","v":"No"}]
[null,null,null,null,null,null,null,{"$f":"'Control Sheet'!K7","v":"No"}]
[null,"Day","Date","Day of Week","Today's Scripture Reading",null,"Date & Time Read"]
[null,"Day 1","2017-01-01",{"$f":"INDEX(DayTable,WEEKDAY(C5))","v":"Sunday"},"Genesis 1-3","gen+1-3"]
[null,"Day 2","2017-01-02","Monday","Genesis 4-7","gen+4-7"]
[null,"Day 3","2017-01-03","Tuesday","Genesis 8-11","gen+8-11"]
[null,"Day 4","2017-01-04","Wednesday","Genesis 12-16","gen+12-16"]
[null,"Day 5","2017-01-05","Thursday","Genesis 17-19","gen+17-19"]
[null,"Day 6","2017-01-06","Friday","Genesis 20-23","gen+20-23"]
[null,"Day 7","2017-01-07","Saturday","Genesis 24-25","gen+24-25"]
[null,"Day 8","2017-01-08","Sunday","Genesis 26-28","gen+26-28"]
[null,"Day 9","2017-01-09","Monday","Genesis 29-30","gen+29-30"]
[null,"Day 10","2017-01-10","Tuesday","Genesis 31-33","gen+31-33"]
[null,"Day 11","2017-01-11","Wednesday","Genesis 34-36","gen+34-36"]
[null,"Day 12","2017-01-12","Thursday","Genesis 37-39","gen+37-39"]
[null,"Day 13","2017-01-13","Friday","Genesis 40-42","gen+40-42"]
[null,"Day 14","2017-01-14","Saturday","Genesis 43-45","gen+43-45"]
[null,"Day 15","2017-01-15","Sunday","Genesis 46-47","gen+46-47"]
[null,"Day 16","2017-01-16","Monday","Genesis 48-50","gen+48-50"]
[null,"Day 17","2017-01-17","Tuesday","Exodus 1-4","ex+1-4"]
[null,"Day 18","2017-01-18","Wednesday","Exodus 5-7","ex+5-7"]
[null,"Day 19","2017-01-19","Thursday","Exodus 8-10","ex+8-10"]
[null,"Day 20","2017-01-20","Friday","Exodus 11-13","ex+11-13"]
[null,"Day 21","2017-01-21","Saturday","Exodus 14-16","ex+14-16"]
[null,"Day 22","2017-01-22","Sunday","Exodus 17-20","ex+17-20"]
[null,"Day 23","2017-01-23","Monday","Exodus 21-23","ex+21-23"]
[null,"Day 24","2017-01-24","Tuesday","Exodus 24-27","ex+24-27"]
[null,"Day 25","2017-01-25","Wednesday","Exodus 28-30","ex+28-30"]
[null,"Day 26","2017-01-26","Thursday","Exodus 31-34","ex+31-34"]
[null,"Day 27","2017-01-27","Friday","Exodus 35-37","ex+35-37"]
[null,"Day 28","2017-01-28","Saturday","Exodus 38-40","ex+38-40"]
[null,"Day 29","2017-01-29","Sunday","Leviticus 1-4","lev+1-4"]
[null,"Day 30","2017-01-30","Monday","Leviticus 5-7","lev+5-7"]
[null,"Day 31","2017-01-31","Tuesday","Leviticus 8-11","lev+8-11"]
[null,"Day 32","2017-02-01","Wednesday","Leviticus 12-14","lev+12-14"]
[null,"Day 33","2017-02-02","Thursday","Leviticus 15-17","lev+15-17"]
[null,"Day 34","2017-02-03","Friday","Leviticus 18-20","lev+18-20"]
[null,"Day 35","2017-02-04","Saturday","Leviticus 21-23","lev+21-23"]
[null,"Day 36","2017-02-05","Sunday","Leviticus 24-25","lev+24-25"]
[null,"Day 37","2017-02-06","Monday","Leviticus 26-27","lev+26-27"]
[null,"Day 38","2017-02-07","Tuesday","Numbers 1-2","num+1-2"]
[null,"Day 39","2017-02-08","Wednesday","Numbers 3-4","num+3-4"]
[null,"Day 40","2017-02-09","Thursday","Numbers 5-6","num+5-6"]
[null,"Day 41","2017-02-10","Friday","Numbers 7-8","num+7-8"]
[null,"Day 42","2017-02-11","Saturday","Numbers 9-11","num+9-11"]
[null,"Day 43","2017-02-12","Sunday","Numbers 12-14","num+12-14"]
[null,"Day 44","2017-02-13","Monday","Numbers 15-17","num+15-17"]
[null,"Day 45","2017-02-14","Tuesday","Numbers 18-20","num+18-20"]
[null,"Day 46","2017-02-15","Wednesday","Numbers 21-23","num+21-23"]
[null,"Day 47","2017-02-16","Thursday","Numbers 24-26","num+24-26"]
[null,"Day 48","2017-02-17","Friday","Numbers 27-30","num+27-30"]
[null,"Day 49","2017-02-18","Saturday","Numbers 31-33","num+31-33"]
[null,"Day 50","2017-02-19","Sunday","Numbers 34-36","num+34-36"]
[null,"Day 51","2017-02-20","Monday","Deuteronomy 1-2","deut+1-2"]
[null,"Day 52","2017-02-21","Tuesday","Deuteronomy 3-4","deut+3-4"]
[null,"Day 53","2017-02-22","Wednesday","Deuteronomy 5-7","deut+5-7"]
[null,"Day 54","2017-02-23","Thursday","Deuteronomy 8-11","deut+8-11"]
[null,"Day 55","2017-02-24","Friday","Deuteronomy 12-15","deut+12-15"]
[null,"Day 56","2017-02-25","Saturday","Deuteronomy 16-19","deut+16-19"]
[null,"Day 57","2017-02-26","Sunday","Deuteronomy 20-23","deut+20-23"]
[null,"Day 58","2017-02-27","Monday","Deuteronomy 24-27","deut+24-27"]
[null,"Day 59","2017-02-28","Tuesday","Deuteronomy 28-29","deut+28-29"]
[null,"Day 60","2017-03-01","Wednesday","Deuteronomy 30-31","deut+30-31"]
[null,"Day 61","2017-03-02","Thursday","Deuteronomy 32-34","deut+32-34"]
[null,"Day 62","2017-03-03","Friday","Joshua 1-4","josh+1-4"]
[null,"Day 63","2017-03-04","Saturday","Joshua 5-7","josh+5-7"]
[null,"Day 64","2017-03-05","Sunday","Joshua 8-10","josh+8-10"]
[null,"Day 65","2017-03-06",{"$f":"INDEX(DayTable,WEEKDAY(C69))","v":"Monday"},"Joshua 11-14","josh+11-14"]
[null,"Day 66","2017-03-07","Tuesday","Joshua 15-18","josh+15-18"]
[null,"Day 67","2017-03-08","Wednesday","Joshua 19-21","josh+19-21"]
[null,"Day 68","2017-03-09","Thursday","Joshua 22-24","josh+22-24"]
[null,"Day 69","2017-03-10","Friday","Judges 1-3","Judges+1-3"]
[null,"Day 70","2017-03-11","Saturday","Judges 4-5","Judges+4-5"]
[null,"Day 71","2017-03-12","Sunday","Judges 6-8","Judges+6-8"]
[null,"Day 72","2017-03-13","Monday","Judges 9-11","Judges+9-11"]
[null,"Day 73","2017-03-14","Tuesday","Judges 12-15","Judges+12-15"]
[null,"Day 74","2017-03-15","Wednesday","Judges 16-18","Judges+16-18"]
[null,"Day 75","2017-03-16","Thursday","Judges 19-21","Judges+19-21"]
[null,"Day 76","2017-03-17","Friday","Ruth 1-4","ruth+1-4"]
[null,"Day 77","2017-03-18","Saturday","I Samuel 1-3","1sam+1-3"]
[null,"Day 78","2017-03-19","Sunday","I Samuel 4-7","1sam+4-7"]
[null,"Day 79","2017-03-20","Monday","I Samuel 8-10","1sam+8-10"]
[null,"Day 80","2017-03-21","Tuesday","I Samuel 11-13","1sam+11-13"]
[null,"Day 81","2017-03-22","Wednesday","I Samuel 14-15","1sam+14-15"]
[null,"Day 82","2017-03-23","Thursday","I Samuel 16-17","1sam+16-17"]
[null,"Day 83","2017-03-24","Friday","I Samuel 18-20","1sam+18-20"]
[null,"Day 84","2017-03-25","Saturday","I Samuel 21-24","1sam+21-24"]
[null,"Day 85","2017-03-26","Sunday","I Samuel 25-27","1sam+25-27"]
[null,"Day 86","2017-03-27","Monday","I Samuel 28-31","1sam+28-31"]
[null,"Day 87","2017-03-28","Tuesday","II Samuel 1-3","2sam+1-3"]
[null,"Day 88","2017-03-29","Wednesday","II Samuel 4-7","2sam+4-7"]
[null,"Day 89","2017-03-30","Thursday","II Samuel 8-11","2sam+8-11"]
[null,"Day 90","2017-03-31","Friday","II Samuel 12-13","2sam+12-13"]
[null,"Day 91","2017-04-01","Saturday","II Samuel 14-15","2sam+14-15"]
[null,"Day 92","2017-04-02","Sunday","II Samuel 16-18","2sam+16-18"]
[null,"Day 93","2017-04-03","Monday","II Samuel 19-20","2sam+19-20"]
[null,"Day 94","2017-04-04","Tuesday","II Samuel 21-22","2sam+21-22"]
[null,"Day 95","2017-04-05","Wednesday","II Samuel 23-24","2sam+23-24"]
[null,"Day 96","2017-04-06","Thursday","I Kings 1-2","1king+1-2"]
[null,"Day 97","2017-04-07","Friday","I Kings 3-5","1king+3-5"]
[null,"Day 98","2017-04-08","Saturday","I Kings 6-7","1king+6-7"]
[null,"Day 99","2017-04-09","Sunday","I Kings 8-9","1king+8-9"]
[null,"Day 100","2017-04-10","Monday","I Kings 10-12","1king+10-12"]
[null,"Day 101","2017-04-11","Tuesday","I Kings 13-15","1king+13-15"]
[null,"Day 102","2017-04-12","Wednesday","I Kings 16-18","1king+16-18"]
[null,"Day 103","2017-04-13","Thursday","I Kings 19-20","1king+19-20"]
[null,"Day 104","2017-04-14","Friday","I Kings 21-22","1king+21-22"]
[null,"Day 105","2017-04-15","Saturday","II Kings 1-3","2king+1-3"]
[null,"Day 106","2017-04-16","Sunday","II Kings 4-5","2king+4-5"]
[null,"Day 107","2017-04-17","Monday","II Kings 6-8","2king+6-8"]
[null,"Day 108","2017-04-18","Tuesday","II Kings 9-11","2king+9-11"]
[null,"Day 109","2017-04-19","Wednesday","II Kings 12-14","2king+12-14"]
[null,"Day 110","2017-04-20","Thursday","II Kings 15-17","2king+15-17"]
[null,"Day 111","2017-04-21","Friday","II Kings 18-20","2king+18-20"]
[null,"Day 112","2017-04-22","Saturday","II Kings 21-23","2king+21-23"]
[null,"Day 113","2017-04-23","Sunday","II Kings 24-25","2king+24-25"]
[null,"Day 114","2017-04-24","Monday","I Chronicles 1-2","1chron+1-2"]
[null,"Day 115","2017-04-25","Tuesday","I Chronicles 3-5","1chron+3-5"]
[null,"Day 116","2017-04-26","Wednesday","I Chronicles 6-7","1chron+6-7"]
[null,"Day 117","2017-04-27","Thursday","I Chronicles 8-10","1chron+8-10"]
[null,"Day 118","2017-04-28","Friday","I Chronicles 11-13","1chron+11-13"]
[null,"Day 119","2017-04-29","Saturday","I Chronicles 14-16","1chron+14-16"]
[null,"Day 120","2017-04-30","Sunday","I Chronicles 17-20","1chron+17-20"]
[null,"Day 121","2017-05-01","Monday","I Chronicles 21-23","1chron+21-23"]
[null,"Day 122","2017-05-02","Tuesday","I Chronicles 24-26","1chron+24-26"]
[null,"Day 123","2017-05-03","Wednesday","I Chronicles 27-29","1chron+27-29"]
[null,"Day 124","2017-05-04","Thursday","II Chronicles 1-4","2chron+1-4"]
[null,"Day 125","2017-05-05","Friday","II Chronicles 5-7","2chron+5-7"]
[null,"Day 126","2017-05-06","Saturday","II Chronicles 8-11","2chron+8-11"]
[null,"Day 127","2017-05-07","Sunday","II Chronicles 12-16","2chron+12-16"]
[null,"Day 128","2017-05-08","Monday","II Chronicles 17-19","2chron+17-19"]
[null,"Day 129","2017-05-09",{"$f":"INDEX(DayTable,WEEKDAY(C133))","v":"Tuesday"},"II Chronicles 20-22","2chron+20-22"]
[null,"Day 130","2017-05-10","Wednesday","II Chronicles 23-25","2chron+23-25"]
[null,"Day 131","2017-05-11","Thursday","II Chronicles 26-29","2chron+26-29"]
[null,"Day 132","2017-05-12","Friday","II Chronicles 30-32","2chron+30-32"]
[null,"Day 133","2017-05-13","Saturday","II Chronicles 33-34","2chron+33-34"]
[null,"Day 134","2017-05-14","Sunday","II Chronicles 35-36","2chron+35-36"]
[null,"Day 135","2017-05-15","Monday","Ezra 1-4","ezra+1-4"]
[null,"Day 136","2017-05-16","Tuesday","Ezra 5-7","ezra+5-7"]
[null,"Day 137","2017-05-17","Wednesday","Ezra 8-10","ezra+8-10"]
[null,"Day 138","2017-05-18","Thursday","Nehemiah 1-4","neh+1-4"]
[null,"Day 139","2017-05-19","Friday","Nehemiah 5-7","neh+5-7"]
[null,"Day 140","2017-05-20","Saturday","Nehemiah 8-10","neh+8-10"]
[null,"Day 141","2017-05-21","Sunday","Nehemiah 11-13","neh+11-13"]
[null,"Day 142","2017-05-22","Monday","Esther 1-4","est+1-4"]
[null,"Day 143","2017-05-23","Tuesday","Esther 5-10","est+5-10"]
[null,"Day 144","2017-05-24","Wednesday","Job 1-4","job+1-4"]
[null,"Day 145","2017-05-25","Thursday","Job 5-8","job+5-8"]
[null,"Day 146","2017-05-26","Friday","Job 9-12","job+9-12"]
[null,"Day 147","2017-05-27","Saturday","Job 13-17","job+13-17"]
[null,"Day 148","2017-05-28","Sunday","Job 18-21","job+18-21"]
[null,"Day 149","2017-05-29","Monday","Job 22-26","job+22-26"]
[null,"Day 150","2017-05-30","Tuesday","Job 27-30","job+27-30"]
[null,"Day 151","2017-05-31","Wednesday","Job 31-34","job+31-34"]
[null,"Day 152","2017-06-01","Thursday","Job 35-38","job+35-38"]
[null,"Day 153","2017-06-02","Friday","Job 39-42","job+39-42"]
[null,"Day 154","2017-06-03","Saturday","Psalms 1-7","ps+1-7"]
[null,"Day 155","2017-06-04","Sunday","Psalms 8-14","ps+8-14"]
[null,"Day 156","2017-06-05","Monday","Psalms 15-18","ps+15-18"]
[null,"Day 157","2017-06-06","Tuesday","Psalms 19-24","ps+19-24"]
[null,"Day 158","2017-06-07","Wednesday","Psalms 25-30","ps+25-30"]
[null,"Day 159","2017-06-08","Thursday","Psalms 31-34","ps+31-34"]
[null,"Day 160","2017-06-09","Friday","Psalms 35-37","ps+35-37"]
[null,"Day 161","2017-06-10","Saturday","Psalms 38-42","ps+38-42"]
[null,"Day 162","2017-06-11","Sunday","Psalms 43-48","ps+43-48"]
[null,"Day 163","2017-06-12","Monday","Psalms 49-54","ps+49-54"]
[null,"Day 164","2017-06-13","Tuesday","Psalms 55-60","ps+55-60"]
[null,"Day 165","2017-06-14","Wednesday","Psalms 61-67","ps+61-67"]
[null,"Day 166","2017-06-15","Thursday","Psalms 68-71","ps+68-71"]
[null,"Day 167","2017-06-16","Friday","Psalms 72-75","ps+72-75"]
[null,"Day 168","2017-06-17","Saturday","Psalms 76-78","ps+76-78"]
[null,"Day 169","2017-06-18","Sunday","Psalms 79-84","ps+79-84"]
[null,"Day 170","2017-06-19","Monday","Psalms 85-89","ps+85-89"]
[null,"Day 171","2017-06-20","Tuesday","Psalms 90-95","ps+90-95"]
[null,"Day 172","2017-06-21","Wednesday","Psalms 96-102","ps+96-102"]
[null,"Day 173","2017-06-22","Thursday","Psalms 103-105","ps+103-105"]
[null,"Day 174","2017-06-23","Friday","Psalms 106-108","ps+106-108"]
[null,"Day 175","2017-06-24","Saturday","Psalms 109-115","ps+109-115"]
[null,"Day 176","2017-06-25","Sunday","Psalms 116-118","ps+116-118"]
[null,"Day 177","2017-06-26","Monday","Psalms 119","ps+119"]
[null,"Day 178","2017-06-27","Tuesday","Psalms 120-131","ps+120-131"]
[null,"Day 179","2017-06-28","Wednesday","Psalms 132-138","ps+132-138"]
[null,"Day 180","2017-06-29","Thursday","Psalms 139-144","ps+139-144"]
[null,"Day 181","2017-06-30","Friday","Psalms 145-150","ps+145-150"]
[null,"Day 182","2017-07-01","Saturday","Proverbs 1-3","prov+1-3"]
[null,"Day 183","2017-07-02","Sunday","Proverbs 4-7","prov+4-7"]
[null,"Day 184","2017-07-03","Monday","Proverbs 8-10","prov+8-10"]
[null,"Day 185","2017-07-04","Tuesday","Proverbs 11-13","prov+11-13"]
[null,"Day 186","2017-07-05","Wednesday","Proverbs 14-16","prov+14-16"]
[null,"Day 187","2017-07-06","Thursday","Proverbs 17-19","prov+17-19"]
[null,"Day 188","2017-07-07","Friday","Proverbs 20-22","prov+20-22"]
[null,"Day 189","2017-07-08","Saturday","Proverbs 23-25","prov+23-25"]
[null,"Day 190","2017-07-09","Sunday","Proverbs 26-28","prov+26-28"]
[null,"Day 191","2017-07-10","Monday","Proverbs 29-31","prov+29-31"]
[null,"Day 192","2017-07-11","Tuesday","Ecclesiastes 1-4","ecc+1-4"]
[null,"Day 193","2017-07-12",{"$f":"INDEX(DayTable,WEEKDAY(C197))","v":"Wednesday"},"Ecclesiastes 5-8","ecc+5-8"]
[null,"Day 194","2017-07-13","Thursday","Ecclesiastes 9-12","ecc+9-12"]
[null,"Day 195","2017-07-14","Friday","Song of Solomon 1-4","solomon+1-4"]
[null,"Day 196","2017-07-15","Saturday","Song of Solomon 5-8","solomon+5-8"]
[null,"Day 197","2017-07-16","Sunday","Isaiah 1-3","is+1-3"]
[null,"Day 198","2017-07-17","Monday","Isaiah 4-6","is+4-6"]
[null,"Day 199","2017-07-18","Tuesday","Isaiah 7-9","is+7-9"]
[null,"Day 200","2017-07-19","Wednesday","Isaiah 10-13","is+10-13"]
[null,"Day 201","2017-07-20","Thursday","Isaiah 14-16","is+14-16"]
[null,"Day 202","2017-07-21","Friday","Isaiah 17-21","is+17-21"]
[null,"Day 203","2017-07-22","Saturday","Isaiah 22-25","is+22-25"]
[null,"Day 204","2017-07-23","Sunday","Isaiah 26-28","is+26-28"]
[null,"Day 205","2017-07-24","Monday","Isaiah 29-31","is+29-31"]
[null,"Day 206","2017-07-25","Tuesday","Isaiah 32-34","is+32-34"]
[null,"Day 207","2017-07-26","Wednesday","Isaiah 35-37","is+35-37"]
[null,"Day 208","2017-07-27","Thursday","Isaiah 38-40","is+38-40"]
[null,"Day 209","2017-07-28","Friday","Isaiah 41-42","is+41-42"]
[null,"Day 210","2017-07-29","Saturday","Isaiah 43-44","is+43-44"]
[null,"Day 211","2017-07-30","Sunday","Isaiah 45-47","is+45-47"]
[null,"Day 212","2017-07-31","Monday","Isaiah 48-50","is+48-50"]
[null,"Day 213","2017-08-01","Tuesday","Isaiah 51-53","is+51-53"]
[null,"Day 214","2017-08-02","Wednesday","Isaiah 54-57","is+54-57"]
[null,"Day 215","2017-08-03","Thursday","Isaiah 58-60","is+58-60"]
[null,"Day 216","2017-08-04","Friday","Isaiah 61-64","is+61-64"]
[null,"Day 217","2017-08-05","Saturday","Isaiah 65-66","is+65-66"]
[null,"Day 218","2017-08-06","Sunday","Jeremiah 1-3","jer+1-3"]
[null,"Day 219","2017-08-07","Monday","Jeremiah 4-5","jer+4-5"]
[null,"Day 220","2017-08-08","Tuesday","Jeremiah 6-8","jer+6-8"]
[null,"Day 221","2017-08-09","Wednesday","Jeremiah 9-11","jer+9-11"]
[null,"Day 222","2017-08-10","Thursday","Jeremiah 12-14","jer+12-14"]
[null,"Day 223","2017-08-11","Friday","Jeremiah 15-17","jer+15-17"]
[null,"Day 224","2017-08-12","Saturday","Jeremiah 18-21","jer+18-21"]
[null,"Day 225","2017-08-13","Sunday","Jeremiah 22-23","jer+22-23"]
[null,"Day 226","2017-08-14","Monday","Jeremiah 24-26","jer+24-26"]
[null,"Day 227","2017-08-15","Tuesday","Jeremiah 27-29","jer+27-29"]
[null,"Day 228","2017-08-16","Wednesday","Jeremiah 30-31","jer+30-31"]
[null,"Day 229","2017-08-17","Thursday","Jeremiah 32-34","jer+32-34"]
[null,"Day 230","2017-08-18","Friday","Jeremiah 35-37","jer+35-37"]
[null,"Day 231","2017-08-19","Saturday","Jeremiah 38-41","jer+38-41"]
[null,"Day 232","2017-08-20","Sunday","Jeremiah 42-45","jer+42-45"]
[null,"Day 233","2017-08-21","Monday","Jeremiah 46-48","jer+46-48"]
[null,"Day 234","2017-08-22","Tuesday","Jeremiah 49","jer+49"]
[null,"Day 235","2017-08-23","Wednesday","Jeremiah 50","jer+50"]
[null,"Day 236","2017-08-24","Thursday","Jeremiah 51-52","jer+51-52"]
[null,"Day 237","2017-08-25","Friday","Lamentations 1-2","lam+1-2"]
[null,"Day 238","2017-08-26","Saturday","Lamentations 3-5","lam+3-5"]
[null,"Day 239","2017-08-27","Sunday","Ezekiel 1-4","ezek+1-4"]
[null,"Day 240","2017-08-28","Monday","Ezekiel 5-9","ezek+5-9"]
[null,"Day 241","2017-08-29","Tuesday","Ezekiel 10-13","ezek+10-13"]
[null,"Day 242","2017-08-30","Wednesday","Ezekiel 14-16","ezek+14-16"]
[null,"Day 243","2017-08-31","Thursday","Ezekiel 17-19","ezek+17-19"]
[null,"Day 244","2017-09-01","Friday","Ezekiel 20-21","ezek+20-21"]
[null,"Day 245","2017-09-02","Saturday","Ezekiel 22-23","ezek+22-23"]
[null,"Day 246","2017-09-03","Sunday","Ezekiel 24-26","ezek+24-26"]
[null,"Day 247","2017-09-04","Monday","Ezekiel 27-28","ezek+27-28"]
[null,"Day 248","2017-09-05","Tuesday","Ezekiel 29-31","ezek+29-31"]
[null,"Day 249","2017-09-06","Wednesday","Ezekiel 32-33","ezek+32-33"]
[null,"Day 250","2017-09-07","Thursday","Ezekiel 34-36","ezek+34-36"]
[null,"Day 251","2017-09-08","Friday","Ezekiel 37-39","ezek+37-39"]
[null,"Day 252","2017-09-09","Saturday","Ezekiel 40-42","ezek+40-42"]
[null,"Day 253","2017-09-10","Sunday","Ezekiel 43-45","ezek+43-45"]
[null,"Day 254","2017-09-11","Monday","Ezekiel 46-48","ezek+46-48"]
[null,"Day 255","2017-09-12","Tuesday","Daniel 1-2","dan+1-2"]
[null,"Day 256","2017-09-13","Wednesday","Daniel 3-4","dan+3-4"]
[null,"Day 257","2017-09-14",{"$f":"INDEX(DayTable,WEEKDAY(C261))","v":"Thursday"},"Daniel 5-6","dan+5-6"]
[null,"Day 258","2017-09-15","Friday","Daniel 7-9","dan+7-9"]
[null,"Day 259","2017-09-16","Saturday","Daniel 10-12","dan+10-12"]
[null,"Day 260","2017-09-17","Sunday","Hosea 1-4","hos+1-4"]
[null,"Day 261","2017-09-18","Monday","Hosea 5-9","hos+5-9"]
[null,"Day 262","2017-09-19","Tuesday","Hosea 10-14","hos+10-14"]
[null,"Day 263","2017-09-20","Wednesday","Joel 1-3","joel+1-3"]
[null,"Day 264","2017-09-21","Thursday","Amos 1-3","amos+1-3"]
[null,"Day 265","2017-09-22","Friday","Amos 4-6","amos+4-6"]
[null,"Day 266","2017-09-23","Saturday","Amos 7-9","amos+7-9"]
[null,"Day 267","2017-09-24","Sunday","Obadiah & Jonah","oba,jonah"]
[null,"Day 268","2017-09-25","Monday","Micah 1-4","micah+1-4"]
[null,"Day 269","2017-09-26","Tuesday","Micah 5-7","micah+5-7"]
[null,"Day 270","2017-09-27","Wednesday","Nahum 1-3","nahum+1-3"]
[null,"Day 271","2017-09-28","Thursday","Habakkuk 1-3","habakkuk+1-3"]
[null,"Day 272","2017-09-29","Friday","Zephaniah 1-3","zephaniah+1-3"]
[null,"Day 273","2017-09-30","Saturday","Haggai 1-2","haggai+1-2"]
[null,"Day 274","2017-10-01","Sunday","Zechariah 1-6","zech+1-6"]
[null,"Day 275","2017-10-02","Monday","Zechariah 7-10","zech+7-10"]
[null,"Day 276","2017-10-03","Tuesday","Zechariah 11-14","zech+11-14"]
[null,"Day 277","2017-10-04","Wednesday","Malachi 1-4","malachi+1-4"]
[null,"Day 278","2017-10-05","Thursday","Matthew 1-4","matt+1-4"]
[null,"Day 279","2017-10-06","Friday","Matthew 5-7","matt+5-7"]
[null,"Day 280","2017-10-07","Saturday","Matthew 8-9","matt+8-9"]
[null,"Day 281","2017-10-08","Sunday","Matthew 10-12","matt+10-12"]
[null,"Day 282","2017-10-09","Monday","Matthew 13-14","matt+13-14"]
[null,"Day 283","2017-10-10","Tuesday","Matthew 15-17","matt+15-17"]
[null,"Day 284","2017-10-11","Wednesday","Matthew 18-20","matt+18-20"]
[null,"Day 285","2017-10-12","Thursday","Matthew 21-22","matt+21-22"]
[null,"Day 286","2017-10-13","Friday","Matthew 23-24","matt+23-24"]
[null,"Day 287","2017-10-14","Saturday","Matthew 25-26","matt+25-26"]
[null,"Day 288","2017-10-15","Sunday","Matthew 27-28","matt+27-28"]
[null,"Day 289","2017-10-16","Monday","Mark 1-3","mark+1-3"]
[null,"Day 290","2017-10-17","Tuesday","Mark 4-6","mark+4-6"]
[null,"Day 291","2017-10-18","Wednesday","Mark 7-9","mark+7-9"]
[null,"Day 292","2017-10-19","Thursday","Mark 10-13","mark+10-13"]
[null,"Day 293","2017-10-20","Friday","Mark 14-16","mark+14-16"]
[null,"Day 294","2017-10-21","Saturday","Luke 1","luke+1"]
[null,"Day 295","2017-10-22","Sunday","Luke 2-3","luke+2-3"]
[null,"Day 296","2017-10-23","Monday","Luke 4-5","luke+4-5"]
[null,"Day 297","2017-10-24","Tuesday","Luke 6-7","luke+6-7"]
[null,"Day 298","2017-10-25","Wednesday","Luke 8-9","luke+8-9"]
[null,"Day 299","2017-10-26","Thursday","Luke 10-11","luke+10-11"]
[null,"Day 300","2017-10-27","Friday","Luke 12-13","luke+12-13"]
[null,"Day 301","2017-10-28","Saturday","Luke 14-16","luke+14-16"]
[null,"Day 302","2017-10-29","Sunday","Luke 17-18","luke+17-18"]
[null,"Day 303","2017-10-30","Monday","Luke 19-20","luke+19-20"]
[null,"Day 304","2017-10-31","Tuesday","Luke 21-22","luke+21-22"]
[null,"Day 305","2017-11-01","Wednesday","Luke 23-24","luke+23-24"]
[null,"Day 306","2017-11-02","Thursday","John 1-3","john+1-3"]
[null,"Day 307","2017-11-03","Friday","John 4-5","john+4-5"]
[null,"Day 308","2017-11-04","Saturday","John 6-7","john+6-7"]
[null,"Day 309","2017-11-05","Sunday","John 8-9","john+8-9"]
[null,"Day 310","2017-11-06","Monday","John 10-11","john+10-11"]
[null,"Day 311","2017-11-07","Tuesday","John 12-13","john+12-13"]
[null,"Day 312","2017-11-08","Wednesday","John 14-15","john+14-15"]
[null,"Day 313","2017-11-09","Thursday","John 16-17","john+16-17"]
[null,"Day 314","2017-11-10","Friday","John 18-19","john+18-19"]
[null,"Day 315","2017-11-11","Saturday","John 20-21","john+20-21"]
[null,"Day 316","2017-11-12","Sunday","Acts 1-2","acts+1-2"]
[null,"Day 317","2017-11-13","Monday","Acts 3-4","acts+3-4"]
[null,"Day 318","2017-11-14","Tuesday","Acts 5-6","acts+5-6"]
[null,"Day 319","2017-11-15","Wednesday","Acts 7-8","acts+7-8"]
[null,"Day 320","2017-11-16","Thursday","Acts 9-12","acts+9-12"]
[null,"Day 321","2017-11-17",{"$f":"INDEX(DayTable,WEEKDAY(C325))","v":"Friday"},"Acts 13-16","acts+13-16"]
[null,"Day 322","2017-11-18","Saturday","Acts 17-19","acts+17-19"]
[null,"Day 323","2017-11-19","Sunday","Acts 20-23","acts+20-23"]
[null,"Day 324","2017-11-20","Monday","Acts 24-28","acts+24-28"]
[null,"Day 325","2017-11-21","Tuesday","Romans 1-3","rom+1-3"]
[null,"Day 326","2017-11-22","Wednesday","Romans 4-7","rom+4-7"]
[null,"Day 327","2017-11-23","Thursday","Romans 8-10","rom+8-10"]
[null,"Day 328","2017-11-24","Friday","Romans 11-13","rom+11-13"]
[null,"Day 329","2017-11-25","Saturday","Romans 14-16","rom+14-16"]
[null,"Day 330","2017-11-26","Sunday","I Corinthians 1-4","1cor+1-4"]
[null,"Day 331","2017-11-27","Monday","I Corinthians 5-9","1cor+5-9"]
[null,"Day 332","2017-11-28","Tuesday","I Corinthians 10-13","1cor+10-13"]
[null,"Day 333","2017-11-29","Wednesday","I Corinthians 14-16","1cor+14-16"]
[null,"Day 334","2017-11-30","Thursday","II Corinthians 1-4","2cor+1-4"]
[null,"Day 335","2017-12-01","Friday","II Corinthians 5-7","2cor+5-7"]
[null,"Day 336","2017-12-02","Saturday","II Corinthians 8-10","2cor+8-10"]
[null,"Day 337","2017-12-03","Sunday","II Corinthians 11-13","2cor+11-13"]
[null,"Day 338","2017-12-04","Monday","Galatians 1-3","gal+1-3"]
[null,"Day 339","2017-12-05","Tuesday","Galatians 4-6","gal+4-6"]
[null,"Day 340","2017-12-06","Wednesday","Ephesians 1-3","ephesians+1-3"]
[null,"Day 341","2017-12-07","Thursday","Ephesians 4-6","ephesians+4-6"]
[null,"Day 342","2017-12-08","Friday","Philippians 1-4","philippians+1-4"]
[null,"Day 343","2017-12-09","Saturday","Colossians 1-4","colossians+1-4"]
[null,"Day 344","2017-12-10","Sunday","I Thessalonians 1-3","1thess+1-3"]
[null,"Day 345","2017-12-11","Monday","I Thessalonians 4-5","1thess+4-5"]
[null,"Day 346","2017-12-12","Tuesday","II Thessalonians 1-3","2thess+1-3"]
[null,"Day 347","2017-12-13","Wednesday","I Timothy 1-6","1tim+1-6"]
[null,"Day 348","2017-12-14","Thursday","II Timothy 1-4","2tim+1-4"]
[null,"Day 349","2017-12-15","Friday","Titus & Philemon","titus,philemon"]
[null,"Day 350","2017-12-16","Saturday","Hebrews 1-4","heb+1-4"]
[null,"Day 351","2017-12-17","Sunday","Hebrews 5-7","heb+5-7"]
[null,"Day 352","2017-12-18","Monday","Hebrews 8-10","heb+8-10"]
[null,"Day 353","2017-12-19","Tuesday","Hebrews 11-13","heb+11-13"]
[null,"Day 354","2017-12-20","Wednesday","James 1-5","james+1-5"]
[null,"Day 355","2017-12-21","Thursday","I Peter 1-5","1peter+1-5"]
[null,"Day 356","2017-12-22","Friday","II Peter 1-3","2peter+1-3"]
[null,"Day 357","2017-12-23","Saturday","I John 1-5","1john+1-5"]
[null,"Day 358","2017-12-24","Sunday","II John & III John","2john,3john"]
[null,"Day 359","2017-12-25","Monday","Jude","jude"]
[null,"Day 360","2017-12-26","Tuesday","Revelation 1-3","rev+1-3"]
[null,"Day 361","2017-12-27","Wednesday","Revelation 4-7","rev+4-7"]
[null,"Day 362","2017-12-28","Thursday","Revelation 8-12","rev+8-12"]
[null,"Day 363","2017-12-29","Friday","Revelation 13-16","rev+13-16"]
[null,"Day 364","2017-12-30","Saturday","Revelation 17-19","rev+17-19"]
[null,"Day 365","2017-12-31","Sunday","Revelation 20-22","rev+20-22"]

{"sheet":"Control Sheet","index":1,"n_rows":86,"n_cols":11,"rows_kept":86,"cut":false,"hidden":false,"merged":[[0,9,0,10]]}
["Bible book","Short Name","Hyper Name",{"$f":"COUNTA(A2:A136)","v":85},"Day of Week",null,"Bible","Bible Code",null,"Controls"]
["Genesis","Gen",{"$f":"LOWER(B2)","v":"gen"},null,"Sunday",null,"New International Version","NIV1984",null,"Year",2017]
["Exodus","Ex",{"$f":"LOWER(B3)","v":"ex"},null,"Monday",null,"English Standard Version","ESV",null,"Version 1","NIV1984"]
["Leviticus","Lev","lev",null,"Tuesday",null,"King James Version","KJV",null,"Version 2","ESV"]
["Numbers","Num","num",null,"Wednesday",null,"American Standard Version","ASV",null,"Run Start-up?","Yes"]
["Deuteronomy","Deut","deut",null,"Thursday",null,"Amplified Bible","AMP",null,"Today's Date",{"$f":"TODAY()","v":"2016-12-25"}]
["Joshua","Josh","josh",null,"Friday",null,"Common English Bible","CEB",null,"Clear column G","No"]
["Judges","Judges","Judges",null,"Saturday",null,"Contemporary English Version","CEV"]
["Ruth","Ruth","ruth",null,null,null,"Easy-to-Read Version","ERV"]
["1 Samuel","1Sam","1sam",null,null,null,"Good News Translation","GNT"]
["2 Samuel","2Sam","2sam",null,null,null,"New American Standard Bible","NASB"]
["1 Kings","1King","1king",null,null,null,"New International Reader's Version","NIRV"]
["2 Kings","2King","2king",null,null,null,"New Living Translation","NLT"]
["1 Chronicles","1Chron","1chron",null,null,null,"Today's New International Version","TNIV"]
["2 Chronicles","2Chron","2chron",null,null,null,"Wycliffe Bible","WYC",null,"Protect","No"]
["Ezra","Ezra","ezra",null,null,null,"Young's Literal Translation","YLT",null,"Bible Table Address","$G$2:$G$16"]
["Nehemiah","Neh","neh",null,null,null,null,null,null,"Books Table Address","$A$2:$A$86"]
["Esther","Est","est"]
["Job","Job","job"]
["Psalm","Ps",{"$f":"LOWER(B20)","v":"ps"}]
["Proverbs","Prov","prov"]
["Ecclesiastes","Ecc","ecc"]
["Song of Solomon","Solomon","solomon"]
["Isaiah","Is","is"]
["Jeremiah","Jer","jer"]
["Lamentations","Lam","lam"]
["Ezekiel","Ezek","ezek"]
["Daniel","Dan","dan"]
["Hosea","Hos","hos"]
["Joel","Joel","joel"]
["Amos","Amos","amos"]
["Obadiah","Oba","oba"]
["Jonah","Jonah","jonah"]
["Micah","Micah","micah"]
["Nahum","Nahum","nahum"]
["Habakkuk","Habakkuk","habakkuk"]
["Zephaniah","Zephaniah","zephaniah"]
["Haggai","Haggai","haggai"]
["Zechariah","Zech","zech"]
["Malachi","Malachi","malachi"]
["Matthew","Matt","matt"]
["Mark","Mark","mark"]
["Luke","Luke","luke"]
["John","John","john"]
["Acts","Acts","acts"]
["Romans","Rom","rom"]
["1 Corinthians","1Cor","1cor"]
["2 Corinthians","2Cor","2cor"]
["Galatians","Gal","gal"]
["Ephesians","Ephesians","ephesians"]
["Philippians","Philippians","philippians"]
["Colossians","Colossians","colossians"]
["1 Thessalonians","1Thess","1thess"]
["2 Thessalonians","2Thess","2thess"]
["1 Timothy","1Tim","1tim"]
["2 Timothy","2Tim","2tim"]
["Titus","Titus","titus"]
["Philemon","Philemon","philemon"]
["Hebrews","Heb","heb"]
["James","James","james"]
["1 Peter","1Peter","1peter"]
["2 Peter","2Peter","2peter"]
["1 John","1John","1john"]
["2 John","2John","2john"]
["3 John","3John","3john"]
["Jude","Jude","jude"]
["Revelation","Rev",{"$f":"LOWER(B67)","v":"rev"}]
["Psalms","Ps",{"$f":"LOWER(B68)","v":"ps"}]
["Song of Songs","Solomon",{"$f":"LOWER(B69)","v":"solomon"}]
["I Samuel","1Sam",{"$f":"LOWER(B70)","v":"1sam"}]
["II Samuel","2Sam","2sam"]
["I Kings","1King","1king"]
["II Kings","2King","2king"]
["I Chronicles","1Chron","1chron"]
["II Chronicles","2Chron","2chron"]
["I Peter","1Peter","1peter"]
["II Peter","2Peter","2peter"]
["I John","1John","1john"]
["II John","2John","2john"]
["III John","3John","3john"]
["I Corinthians","1Cor","1cor"]
["II Corinthians","2Cor","2cor"]
["I Thessalonians","1Thess","1thess"]
["II Thessalonians","2Thess","2thess"]
["I Timothy","1Tim","1tim"]
["II Timothy","2Tim","2tim"]

{"sheet":"Source","index":2,"n_rows":366,"n_cols":9,"rows_kept":366,"cut":false,"hidden":false,"merged":[]}
["Day","Today's Scripture Reading",null,null,"VBC --->","Today's Scripture Reading",null,"BibleGateway --->","Today's Scripture Reading"]
["Day 1","Genesis 1-3",null,null,null,"Genesis 1-3",null,null,"Genesis 1-3"]
["Day 2","Genesis 4-7",null,null,null,"Genesis 4-7",null,null,"Genesis 4-6"]
["Day 3","Genesis 8-11",null,null,null,"Genesis 8-11",null,null,"Genesis 7-9"]
["Day 4","Genesis 12-16",null,null,null,"Genesis 12-16",null,null,"Genesis 10-12"]
["Day 5","Genesis 17-19",null,null,null,"Genesis 17-19",null,null,"Genesis 13-15"]
["Day 6","Genesis 20-23",null,null,null,"Genesis 20-23",null,null,"Genesis 16-18"]
["Day 7","Genesis 24-25",null,null,null,"Genesis 24-25",null,null,"Genesis 19-21"]
["Day 8","Genesis 26-28",null,null,null,"Genesis 26-28",null,null,"Genesis 22-24"]
["Day 9","Genesis 29-30",null,null,null,"Genesis 29-30",null,null,"Genesis 25-27"]
["Day 10","Genesis 31-33",null,null,null,"Genesis 31-33",null,null,"Genesis 28-30"]
["Day 11","Genesis 34-36",null,null,null,"Genesis 34-36",null,null,"Genesis 31-33"]
["Day 12","Genesis 37-39",null,null,null,"Genesis 37-39",null,null,"Genesis 34-36"]
["Day 13","Genesis 40-42",null,null,null,"Genesis 40-42",null,null,"Genesis 37-39"]
["Day 14","Genesis 43-45",null,null,null,"Genesis 43-45",null,null,"Genesis 40-42"]
["Day 15","Genesis 46-47",null,null,null,"Genesis 46-47",null,null,"Genesis 43-46"]
["Day 16","Genesis 48-50",null,null,null,"Genesis 48-50",null,null,"Genesis 47-50"]
["Day 17","Exodus 1-4",null,null,null,"Exodus 1-4",null,null,"Exodus 1-3"]
["Day 18","Exodus 5-7",null,null,null,"Exodus 5-7",null,null,"Exodus 4-6"]
["Day 19","Exodus 8-10",null,null,null,"Exodus 8-10",null,null,"Exodus 7-9"]
["Day 20","Exodus 11-13",null,null,null,"Exodus 11-13",null,null,"Exodus 10-12"]
["Day 21","Exodus 14-16",null,null,null,"Exodus 14-16",null,null,"Exodus 13-15"]
["Day 22","Exodus 17-20",null,null,null,"Exodus 17-20",null,null,"Exodus 16-18"]
["Day 23","Exodus 21-23",null,null,null,"Exodus 21-23",null,null,"Exodus 19-21"]
["Day 24","Exodus 24-27",null,null,null,"Exodus 24-27",null,null,"Exodus 22-24"]
["Day 25","Exodus 28-30",null,null,null,"Exodus 28-30",null,null,"Exodus 25-27"]
["Day 26","Exodus 31-34",null,null,null,"Exodus 31-34",null,null,"Exodus 28-30"]
["Day 27","Exodus 35-37",null,null,null,"Exodus 35-37",null,null,"Exodus 31-33"]
["Day 28","Exodus 38-40",null,null,null,"Exodus 38-40",null,null,"Exodus 34-36"]
["Day 29","Leviticus 1-4",null,null,null,"Leviticus 1-4",null,null,"Exodus 37-40"]
["Day 30","Leviticus 5-7",null,null,null,"Leviticus 5-7",null,null,"Leviticus 1-3"]
["Day 31","Leviticus 8-11",null,null,null,"Leviticus 8-11",null,null,"Leviticus 4-6"]
["Day 32","Leviticus 12-14",null,null,null,"Leviticus 12-14",null,null,"Leviticus 7-9"]
["Day 33","Leviticus 15-17",null,null,null,"Leviticus 15-17",null,null,"Leviticus 10-12"]
["Day 34","Leviticus 18-20",null,null,null,"Leviticus 18-20",null,null,"Leviticus 13-15"]
["Day 35","Leviticus 21-23",null,null,null,"Leviticus 21-23",null,null,"Leviticus 16-18"]
["Day 36","Leviticus 24-25",null,null,null,"Leviticus 24-25",null,null,"Leviticus 19-21"]
["Day 37","Leviticus 26-27",null,null,null,"Leviticus 26-27",null,null,"Leviticus 22-24"]
["Day 38","Numbers 1-2",null,null,null,"Numbers 1-2",null,null,"Leviticus 25-27"]
["Day 39","Numbers 3-4",null,null,null,"Numbers 3-4",null,null,"Numbers 1-3"]
["Day 40","Numbers 5-6",null,null,null,"Numbers 5-6",null,null,"Numbers 4-6"]
["Day 41","Numbers 7-8",null,null,null,"Numbers 7-8",null,null,"Numbers 7-9"]
["Day 42","Numbers 9-11",null,null,null,"Numbers 9-11",null,null,"Numbers 10-12"]
["Day 43","Numbers 12-14",null,null,null,"Numbers 12-14",null,null,"Numbers 13-15"]
["Day 44","Numbers 15-17",null,null,null,"Numbers 15-17",null,null,"Numbers 16-18"]
["Day 45","Numbers 18-20",null,null,null,"Numbers 18-20",null,null,"Numbers 19-21"]
["Day 46","Numbers 21-23",null,null,null,"Numbers 21-23",null,null,"Numbers 22-24"]
["Day 47","Numbers 24-26",null,null,null,"Numbers 24-26",null,null,"Numbers 25-27"]
["Day 48","Numbers 27-30",null,null,null,"Numbers 27-30",null,null,"Numbers 28-30"]
["Day 49","Numbers 31-33",null,null,null,"Numbers 31-33",null,null,"Numbers 31-33"]
["Day 50","Numbers 34-36",null,null,null,"Numbers 34-36",null,null,"Numbers 34-36"]
["Day 51","Deuteronomy 1-2",null,null,null,"Deuteronomy 1-2",null,null,"Deuteronomy 1-3"]
["Day 52","Deuteronomy 3-4",null,null,null,"Deuteronomy 3-4",null,null,"Deuteronomy 4-6"]
["Day 53","Deuteronomy 5-7",null,null,null,"Deuteronomy 5-7",null,null,"Deuteronomy 7-9"]
["Day 54","Deuteronomy 8-11",null,null,null,"Deuteronomy 8-11",null,null,"Deuteronomy 10-12"]
["Day 55","Deuteronomy 12-15",null,null,null,"Deuteronomy 12-15",null,null,"Deuteronomy 13-15"]
["Day 56","Deuteronomy 16-19",null,null,null,"Deuteronomy 16-19",null,null,"Deuteronomy 16-18"]
["Day 57","Deuteronomy 20-23",null,null,null,"Deuteronomy 20-23",null,null,"Deuteronomy 19-21"]
["Day 58","Deuteronomy 24-27",null,null,null,"Deuteronomy 24-27",null,null,"Deuteronomy 22-24"]
["Day 59","Deuteronomy 28-29",null,null,null,"Deuteronomy 28-29",null,null,"Deuteronomy 25-27"]
["Day 60","Deuteronomy 30-31",null,null,null,"Deuteronomy 30-31",null,null,"Deuteronomy 28-30"]
["Day 61","Deuteronomy 32-34",null,null,null,"Deuteronomy 32-34",null,null,"Deuteronomy 31-34"]
["Day 62","Joshua 1-4",null,null,null,"Joshua 1-4",null,null,"Joshua 1-3"]
["Day 63","Joshua 5-7",null,null,null,"Joshua 5-7",null,null,"Joshua 4-6"]
["Day 64","Joshua 8-10",null,null,null,"Joshua 8-10",null,null,"Joshua 7-9"]
["Day 65","Joshua 11-14",null,null,null,"Joshua 11-14",null,null,"Joshua 10-12"]
["Day 66","Joshua 15-18",null,null,null,"Joshua 15-18",null,null,"Joshua 13-15"]
["Day 67","Joshua 19-21",null,null,null,"Joshua 19-21",null,null,"Joshua 16-18"]
["Day 68","Joshua 22-24",null,null,null,"Joshua 22-24",null,null,"Joshua 19-21"]
["Day 69","Judges 1-3",null,null,null,"Judges 1-3",null,null,"Joshua 22-24"]
["Day 70","Judges 4-5",null,null,null,"Judges 4-5",null,null,"Judges 1-3"]
["Day 71","Judges 6-8",null,null,null,"Judges 6-8",null,null,"Judges 4-6"]
["Day 72","Judges 9-11",null,null,null,"Judges 9-11",null,null,"Judges 7-9"]
["Day 73","Judges 12-15",null,null,null,"Judges 12-15",null,null,"Judges 10-12"]
["Day 74","Judges 16-18",null,null,null,"Judges 16-18",null,null,"Judges 13-15"]
["Day 75","Judges 19-21",null,null,null,"Judges 19-21",null,null,"Judges 16-18"]
["Day 76","Ruth 1-4",null,null,null,"Ruth 1-4",null,null,"Judges 19-21"]
["Day 77","I Samuel 1-3",null,null,null,"I Samuel 1-3",null,null,"Ruth 1-4"]
["Day 78","I Samuel 4-7",null,null,null,"I Samuel 4-7",null,null,"1 Samuel 1-3"]
["Day 79","I Samuel 8-10",null,null,null,"I Samuel 8-10",null,null,"1 Samuel 4-6"]
["Day 80","I Samuel 11-13",null,null,null,"I Samuel 11-13",null,null,"1 Samuel 7-9"]
["Day 81","I Samuel 14-15",null,null,null,"I Samuel 14-15",null,null,"1 Samuel 10-12"]
["Day 82","I Samuel 16-17",null,null,null,"I Samuel 16-17",null,null,"1 Samuel 13-15"]
["Day 83","I Samuel 18-20",null,null,null,"I Samuel 18-20",null,null,"1 Samuel 16-18"]
["Day 84","I Samuel 21-24",null,null,null,"I Samuel 21-24",null,null,"1 Samuel 19-21"]
["Day 85","I Samuel 25-27",null,null,null,"I Samuel 25-27",null,null,"1 Samuel 22-24"]
["Day 86","I Samuel 28-31",null,null,null,"I Samuel 28-31",null,null,"1 Samuel 25-27"]
["Day 87","II Samuel 1-3",null,null,null,"II Samuel 1-3",null,null,"1 Samuel 28-31"]
["Day 88","II Samuel 4-7",null,null,null,"II Samuel 4-7",null,null,"2 Samuel 1-3"]
["Day 89","II Samuel 8-11",null,null,null,"II Samuel 8-11",null,null,"2 Samuel 4-6"]
["Day 90","II Samuel 12-13",null,null,null,"II Samuel 12-13",null,null,"2 Samuel 7-9"]
["Day 91","II Samuel 14-15",null,null,null,"II Samuel 14-15",null,null,"2 Samuel 10-12"]
["Day 92","II Samuel 16-18",null,null,null,"II Samuel 16-18",null,null,"2 Samuel 13-15"]
["Day 93","II Samuel 19-20",null,null,null,"II Samuel 19-20",null,null,"2 Samuel 16-18"]
["Day 94","II Samuel 21-22",null,null,null,"II Samuel 21-22",null,null,"2 Samuel 19-21"]
["Day 95","II Samuel 23-24",null,null,null,"II Samuel 23-24",null,null,"2 Samuel 22-24"]
["Day 96","I Kings 1-2",null,null,null,"I Kings 1-2",null,null,"1 Kings 1-3"]
["Day 97","I Kings 3-5",null,null,null,"I Kings 3-5",null,null,"1 Kings 4-6"]
["Day 98","I Kings 6-7",null,null,null,"I Kings 6-7",null,null,"1 Kings 7-9"]
["Day 99","I Kings 8-9",null,null,null,"I Kings 8-9",null,null,"1 Kings 10-12"]
["Day 100","I Kings 10-12",null,null,null,"I Kings 10-12",null,null,"1 Kings 13-15"]
["Day 101","I Kings 13-15",null,null,null,"I Kings 13-15",null,null,"1 Kings 16-18"]
["Day 102","I Kings 16-18",null,null,null,"I Kings 16-18",null,null,"1 Kings 19-22"]
["Day 103","I Kings 19-20",null,null,null,"I Kings 19-20",null,null,"2 Kings 1-3"]
["Day 104","I Kings 21-22",null,null,null,"I Kings 21-22",null,null,"2 Kings 4-6"]
["Day 105","II Kings 1-3",null,null,null,"II Kings 1-3",null,null,"2 Kings 7-9"]
["Day 106","II Kings 4-5",null,null,null,"II Kings 4-5",null,null,"2 Kings 10-12"]
["Day 107","II Kings 6-8",null,null,null,"II Kings 6-8",null,null,"2 Kings 13-15"]
["Day 108","II Kings 9-11",null,null,null,"II Kings 9-11",null,null,"2 Kings 16-18"]
["Day 109","II Kings 12-14",null,null,null,"II Kings 12-14",null,null,"2 Kings 19-21"]
["Day 110","II Kings 15-17",null,null,null,"II Kings 15-17",null,null,"2 Kings 22-25"]
["Day 111","II Kings 18-20",null,null,null,"II Kings 18-20",null,null,"1 Chronicles 1-6"]
["Day 112","II Kings 21-23",null,null,null,"II Kings 21-23",null,null,"1 Chronicles 7-9"]
["Day 113","II Kings 24-25",null,null,null,"II Kings 24-25",null,null,"1 Chronicles 10-12"]
["Day 114","I Chronicles 1-2",null,null,null,"I Chronicles 1-2",null,null,"1 Chronicles 13-15"]
["Day 115","I Chronicles 3-5",null,null,null,"I Chronicles 3-5",null,null,"1 Chronicles 16-18"]
["Day 116","I Chronicles 6-7",null,null,null,"I Chronicles 6-7",null,null,"1 Chronicles 19-21"]
["Day 117","I Chronicles 8-10",null,null,null,"I Chronicles 8-10",null,null,"1 Chronicles 22-25"]
["Day 118","I Chronicles 11-13",null,null,null,"I Chronicles 11-13",null,null,"1 Chronicles 26-29"]
["Day 119","I Chronicles 14-16",null,null,null,"I Chronicles 14-16",null,null,"2 Chronicles 1-3"]
["Day 120","I Chronicles 17-20",null,null,null,"I Chronicles 17-20",null,null,"2 Chronicles 4-6"]
["Day 121","I Chronicles 21-23",null,null,null,"I Chronicles 21-23",null,null,"2 Chronicles 7-9"]
["Day 122","I Chronicles 24-26",null,null,null,"I Chronicles 24-26",null,null,"2 Chronicles 10-12"]
["Day 123","I Chronicles 27-29",null,null,null,"I Chronicles 27-29",null,null,"2 Chronicles 13-15"]
["Day 124","II Chronicles 1-4",null,null,null,"II Chronicles 1-4",null,null,"2 Chronicles 16-18"]
["Day 125","II Chronicles 5-7",null,null,null,"II Chronicles 5-7",null,null,"2 Chronicles 19-21"]
["Day 126","II Chronicles 8-11",null,null,null,"II Chronicles 8-11",null,null,"2 Chronicles 22-24"]
["Day 127","II Chronicles 12-16",null,null,null,"II Chronicles 12-16",null,null,"2 Chronicles 25-27"]
["Day 128","II Chronicles 17-19",null,null,null,"II Chronicles 17-19",null,null,"2 Chronicles 28-30"]
["Day 129","II Chronicles 20-22",null,null,null,"II Chronicles 20-22",null,null,"2 Chronicles 31-33"]
["Day 130","II Chronicles 23-25",null,null,null,"II Chronicles 23-25",null,null,"2 Chronicles 34-36"]
["Day 131","II Chronicles 26-29",null,null,null,"II Chronicles 26-29",null,null,"Ezra 1-3"]
["Day 132","II Chronicles 30-32",null,null,null,"II Chronicles 30-32",null,null,"Ezra 4-6"]
["Day 133","II Chronicles 33-34",null,null,null,"II Chronicles 33-34",null,null,"Ezra 7-10"]
["Day 134","II Chronicles 35-36",null,null,null,"II Chronicles 35-36",null,null,"Nehemiah 1-3"]
["Day 135","Ezra 1-4",null,null,null,"Ezra 1-4",null,null,"Nehemiah 4-6"]
["Day 136","Ezra 5-7",null,null,null,"Ezra 5-7",null,null,"Nehemiah 7-9"]
["Day 137","Ezra 8-10",null,null,null,"Ezra 8-10",null,null,"Nehemiah 10-13"]
["Day 138","Nehemiah 1-4",null,null,null,"Nehemiah 1-4",null,null,"Esther 1-3"]
["Day 139","Nehemiah 5-7",null,null,null,"Nehemiah 5-7",null,null,"Esther 4-6"]
["Day 140","Nehemiah 8-10",null,null,null,"Nehemiah 8-10",null,null,"Esther 7-10"]
["Day 141","Nehemiah 11-13",null,null,null,"Nehemiah 11-13",null,null,"Job 1-3"]
["Day 142","Esther 1-4",null,null,null,"Esther 1-4",null,null,"Job 4-6"]
["Day 143","Esther 5-10",null,null,null,"Esther 5-10",null,null,"Job 7-9"]
["Day 144","Job 1-4",null,null,null,"Job 1-4",null,null,"Job 10-12"]
["Day 145","Job 5-8",null,null,null,"Job 5-8",null,null,"Job 13-15"]
["Day 146","Job 9-12",null,null,null,"Job 9-12",null,null,"Job 16-18"]
["Day 147","Job 13-17",null,null,null,"Job 13-17",null,null,"Job 19-21"]
["Day 148","Job 18-21",null,null,null,"Job 18-21",null,null,"Job 22-24"]
["Day 149","Job 22-26",null,null,null,"Job 22-26",null,null,"Job 25-27"]
["Day 150","Job 27-30",null,null,null,"Job 27-30",null,null,"Job 28-30"]
["Day 151","Job 31-34",null,null,null,"Job 31-34",null,null,"Job 31-33"]
["Day 152","Job 35-38",null,null,null,"Job 35-38",null,null,"Job 34-36"]
["Day 153","Job 39-42",null,null,null,"Job 39-42",null,null,"Job 37-39"]
["Day 154","Psalms 1-7",null,null,null,"Psalms 1-7",null,null,"Job 40-42"]
["Day 155","Psalms 8-14",null,null,null,"Psalms 8-14",null,null,"Psalms 1-5"]
["Day 156","Psalms 15-18",null,null,null,"Psalms 15-18",null,null,"Psalms 6-10"]
["Day 157","Psalms 19-24",null,null,null,"Psalms 19-24",null,null,"Psalms 11-15"]
["Day 158","Psalms 25-30",null,null,null,"Psalms 25-30",null,null,"Psalms 16-20"]
["Day 159","Psalms 31-34",null,null,null,"Psalms 31-34",null,null,"Psalms 21-25"]
["Day 160","Psalms 35-37",null,null,null,"Psalms 35-37",null,null,"Psalms 26-30"]
["Day 161","Psalms 38-42",null,null,null,"Psalms 38-42",null,null,"Psalms 31-35"]
["Day 162","Psalms 43-48",null,null,null,"Psalms 43-48",null,null,"Psalms 36-40"]
["Day 163","Psalms 49-54",null,null,null,"Psalms 49-54",null,null,"Psalms 41-45"]
["Day 164","Psalms 55-60",null,null,null,"Psalms 55-60",null,null,"Psalms 46-50"]
["Day 165","Psalms 61-67",null,null,null,"Psalms 61-67",null,null,"Psalms 51-55"]
["Day 166","Psalms 68-71",null,null,null,"Psalms 68-71",null,null,"Psalms 56-60"]
["Day 167","Psalms 72-75",null,null,null,"Psalms 72-75",null,null,"Psalms 61-65"]
["Day 168","Psalms 76-78",null,null,null,"Psalms 76-78",null,null,"Psalms 66-70"]
["Day 169","Psalms 79-84",null,null,null,"Psalms 79-84",null,null,"Psalms 71-75"]
["Day 170","Psalms 85-89",null,null,null,"Psalms 85-89",null,null,"Psalms 76-80"]
["Day 171","Psalms 90-95",null,null,null,"Psalms 90-95",null,null,"Psalms 81-85"]
["Day 172","Psalms 96-102",null,null,null,"Psalms 96-102",null,null,"Psalms 86-90"]
["Day 173","Psalms 103-105",null,null,null,"Psalms 103-105",null,null,"Psalms 91-95"]
["Day 174","Psalms 106-108",null,null,null,"Psalms 106-108",null,null,"Psalms 96-100"]
["Day 175","Psalms 109-115",null,null,null,"Psalms 109-115",null,null,"Psalms 101-105"]
["Day 176","Psalms 116-118",null,null,null,"Psalms 116-118",null,null,"Psalms 106-110"]
["Day 177","Psalms 119",null,null,null,"Psalms 119",null,null,"Psalms 111-115"]
["Day 178","Psalms 120-131",null,null,null,"Psalms 120-131",null,null,"Psalms 116-120"]
["Day 179","Psalms 132-138",null,null,null,"Psalms 132-138",null,null,"Psalms 121-125"]
["Day 180","Psalms 139-144",null,null,null,"Psalms 139-144",null,null,"Psalms 126-130"]
["Day 181","Psalms 145-150",null,null,null,"Psalms 145-150",null,null,"Psalms 131-135"]
["Day 182","Proverbs 1-3",null,null,null,"Proverbs 1-3",null,null,"Psalms 136-140"]
["Day 183","Proverbs 4-7",null,null,null,"Proverbs 4-7",null,null,"Psalms 141-145"]
["Day 184","Proverbs 8-10",null,null,null,"Proverbs 8-10",null,null,"Psalms 146-150"]
["Day 185","Proverbs 11-13",null,null,null,"Proverbs 11-13",null,null,"Proverbs 1-3"]
["Day 186","Proverbs 14-16",null,null,null,"Proverbs 14-16",null,null,"Proverbs 4-6"]
["Day 187","Proverbs 17-19",null,null,null,"Proverbs 17-19",null,null,"Proverbs 7-9"]
["Day 188","Proverbs 20-22",null,null,null,"Proverbs 20-22",null,null,"Proverbs 10-12"]
["Day 189","Proverbs 23-25",null,null,null,"Proverbs 23-25",null,null,"Proverbs 13-15"]
["Day 190","Proverbs 26-28",null,null,null,"Proverbs 26-28",null,null,"Proverbs 16-18"]
["Day 191","Proverbs 29-31",null,null,null,"Proverbs 29-31",null,null,"Proverbs 19-21"]
["Day 192","Ecclesiastes 1-4",null,null,null,"Ecclesiastes 1-4",null,null,"Proverbs 22-24"]
["Day 193","Ecclesiastes 5-8",null,null,null,"Ecclesiastes 5-8",null,null,"Proverbs 25-27"]
["Day 194","Ecclesiastes 9-12",null,null,null,"Ecclesiastes 9-12",null,null,"Proverbs 28-31"]
["Day 195","Song of Solomon 1-4",null,null,null,"Song of Solomon 1-4",null,null,"Ecclesiastes 1-3"]
["Day 196","Song of Solomon 5-8",null,null,null,"Song of Solomon 5-8",null,null,"Ecclesiastes 4-6"]
["Day 197","Isaiah 1-3",null,null,null,"Isaiah 1-3",null,null,"Ecclesiastes 7-9"]
["Day 198","Isaiah 4-6",null,null,null,"Isaiah 4-6",null,null,"Ecclesiastes 10-12"]
["Day 199","Isaiah 7-9",null,null,null,"Isaiah 7-9",null,null,"Song of Songs 1-4"]
["Day 200","Isaiah 10-13",null,null,null,"Isaiah 10-13",null,null,"Song of Songs 5-8"]
["Day 201","Isaiah 14-16",null,null,null,"Isaiah 14-16",null,null,"Isaiah 1-3"]
["Day 202","Isaiah 17-21",null,null,null,"Isaiah 17-21",null,null,"Isaiah 4-6"]
["Day 203","Isaiah 22-25",null,null,null,"Isaiah 22-25",null,null,"Isaiah 7-9"]
["Day 204","Isaiah 26-28",null,null,null,"Isaiah 26-28",null,null,"Isaiah 10-12"]
["Day 205","Isaiah 29-31",null,null,null,"Isaiah 29-31",null,null,"Isaiah 13-15"]
["Day 206","Isaiah 32-34",null,null,null,"Isaiah 32-34",null,null,"Isaiah 16-18"]
["Day 207","Isaiah 35-37",null,null,null,"Isaiah 35-37",null,null,"Isaiah 19-21"]
["Day 208","Isaiah 38-40",null,null,null,"Isaiah 38-40",null,null,"Isaiah 22-24"]
["Day 209","Isaiah 41-42",null,null,null,"Isaiah 41-42",null,null,"Isaiah 25-27"]
["Day 210","Isaiah 43-44",null,null,null,"Isaiah 43-44",null,null,"Isaiah 28-30"]
["Day 211","Isaiah 45-47",null,null,null,"Isaiah 45-47",null,null,"Isaiah 31-33"]
["Day 212","Isaiah 48-50",null,null,null,"Isaiah 48-50",null,null,"Isaiah 34-36"]
["Day 213","Isaiah 51-53",null,null,null,"Isaiah 51-53",null,null,"Isaiah 37-39"]
["Day 214","Isaiah 54-57",null,null,null,"Isaiah 54-57",null,null,"Isaiah 40-42"]
["Day 215","Isaiah 58-60",null,null,null,"Isaiah 58-60",null,null,"Isaiah 43-45"]
["Day 216","Isaiah 61-64",null,null,null,"Isaiah 61-64",null,null,"Isaiah 46-48"]
["Day 217","Isaiah 65-66",null,null,null,"Isaiah 65-66",null,null,"Isaiah 49-51"]
["Day 218","Jeremiah 1-3",null,null,null,"Jeremiah 1-3",null,null,"Isaiah 52-54"]
["Day 219","Jeremiah 4-5",null,null,null,"Jeremiah 4-5",null,null,"Isaiah 55-57"]
["Day 220","Jeremiah 6-8",null,null,null,"Jeremiah 6-8",null,null,"Isaiah 58-60"]
["Day 221","Jeremiah 9-11",null,null,null,"Jeremiah 9-11",null,null,"Isaiah 61-63"]
["Day 222","Jeremiah 12-14",null,null,null,"Jeremiah 12-14",null,null,"Isaiah 64-66"]
["Day 223","Jeremiah 15-17",null,null,null,"Jeremiah 15-17",null,null,"Jeremiah 1-3"]
["Day 224","Jeremiah 18-21",null,null,null,"Jeremiah 18-21",null,null,"Jeremiah 4-6"]
["Day 225","Jeremiah 22-23",null,null,null,"Jeremiah 22-23",null,null,"Jeremiah 7-9"]
["Day 226","Jeremiah 24-26",null,null,null,"Jeremiah 24-26",null,null,"Jeremiah 10-12"]
["Day 227","Jeremiah 27-29",null,null,null,"Jeremiah 27-29",null,null,"Jeremiah 13-15"]
["Day 228","Jeremiah 30-31",null,null,null,"Jeremiah 30-31",null,null,"Jeremiah 16-18"]
["Day 229","Jeremiah 32-34",null,null,null,"Jeremiah 32-34",null,null,"Jeremiah 19-21"]
["Day 230","Jeremiah 35-37",null,null,null,"Jeremiah 35-37",null,null,"Jeremiah 22-24"]
["Day 231","Jeremiah 38-41",null,null,null,"Jeremiah 38-41",null,null,"Jeremiah 25-27"]
["Day 232","Jeremiah 42-45",null,null,null,"Jeremiah 42-45",null,null,"Jeremiah 28-30"]
["Day 233","Jeremiah 46-48",null,null,null,"Jeremiah 46-48",null,null,"Jeremiah 31-33"]
["Day 234","Jeremiah 49",null,null,null,"Jeremiah 49",null,null,"Jeremiah 34-36"]
["Day 235","Jeremiah 50",null,null,null,"Jeremiah 50",null,null,"Jeremiah 37-39"]
["Day 236","Jeremiah 51-52",null,null,null,"Jeremiah 51-52",null,null,"Jeremiah 40-42"]
["Day 237","Lamentations 1-2",null,null,null,"Lamentations 1-2",null,null,"Jeremiah 43-45"]
["Day 238","Lamentations 3-5",null,null,null,"Lamentations 3-5",null,null,"Jeremiah 46-48"]
["Day 239","Ezekiel 1-4",null,null,null,"Ezekiel 1-4",null,null,"Jeremiah 49-52"]
["Day 240","Ezekiel 5-9",null,null,null,"Ezekiel 5-9",null,null,"Lamentations 1-3"]
["Day 241","Ezekiel 10-13",null,null,null,"Ezekiel 10-13",null,null,"Lamentations 4-5"]
["Day 242","Ezekiel 14-16",null,null,null,"Ezekiel 14-16",null,null,"Ezekiel 1-3"]
["Day 243","Ezekiel 17-19",null,null,null,"Ezekiel 17-19",null,null,"Ezekiel 4-6"]
["Day 244","Ezekiel 20-21",null,null,null,"Ezekiel 20-21",null,null,"Ezekiel 7-9"]
["Day 245","Ezekiel 22-23",null,null,null,"Ezekiel 22-23",null,null,"Ezekiel 10-12"]
["Day 246","Ezekiel 24-26",null,null,null,"Ezekiel 24-26",null,null,"Ezekiel 13-15"]
["Day 247","Ezekiel 27-28",null,null,null,"Ezekiel 27-28",null,null,"Ezekiel 16-18"]
["Day 248","Ezekiel 29-31",null,null,null,"Ezekiel 29-31",null,null,"Ezekiel 19-21"]
["Day 249","Ezekiel 32-33",null,null,null,"Ezekiel 32-33",null,null,"Ezekiel 22-24"]
["Day 250","Ezekiel 34-36",null,null,null,"Ezekiel 34-36",null,null,"Ezekiel 25-27"]
["Day 251","Ezekiel 37-39",null,null,null,"Ezekiel 37-39",null,null,"Ezekiel 28-30"]
["Day 252","Ezekiel 40-42",null,null,null,"Ezekiel 40-42",null,null,"Ezekiel 31-33"]
["Day 253","Ezekiel 43-45",null,null,null,"Ezekiel 43-45",null,null,"Ezekiel 34-36"]
["Day 254","Ezekiel 46-48",null,null,null,"Ezekiel 46-48",null,null,"Ezekiel 37-40"]
["Day 255","Daniel 1-2",null,null,null,"Daniel 1-2",null,null,"Ezekiel 41-44"]
["Day 256","Daniel 3-4",null,null,null,"Daniel 3-4",null,null,"Ezekiel 45-48"]
["Day 257","Daniel 5-6",null,null,null,"Daniel 5-6",null,null,"Daniel 1-3"]
["Day 258","Daniel 7-9",null,null,null,"Daniel 7-9",null,null,"Daniel 4-6"]
["Day 259","Daniel 10-12",null,null,null,"Daniel 10-12",null,null,"Daniel 7-9"]
["Day 260","Hosea 1-4",null,null,null,"Hosea 1-4",null,null,"Daniel 10-12"]
["Day 261","Hosea 5-9",null,null,null,"Hosea 5-9",null,null,"Hosea 1-3"]
["Day 262","Hosea 10-14",null,null,null,"Hosea 10-14",null,null,"Hosea 4-6"]
["Day 263","Joel 1-3",null,null,null,"Joel 1-3",null,null,"Hosea 7-10"]
["Day 264","Amos 1-3",null,null,null,"Amos 1-3",null,null,"Hosea 11-14"]
["Day 265","Amos 4-6",null,null,null,"Amos 4-6",null,null,"Joel 1-3"]
["Day 266","Amos 7-9",null,null,null,"Amos 7-9",null,null,"Amos 1-3"]
["Day 267","Obadiah & Jonah",null,null,null,"Obadiah & Jonah",null,null,"Amos 4-6"]
["Day 268","Micah 1-4",null,null,null,"Micah 1-4",null,null,"Amos 7-9"]
["Day 269","Micah 5-7",null,null,null,"Micah 5-7",null,null,"Obadiah"]
["Day 270","Nahum 1-3",null,null,null,"Nahum 1-3",null,null,"Jonah 1-4"]
["Day 271","Habakkuk 1-3",null,null,null,"Habakkuk 1-3",null,null,"Micah 1-3"]
["Day 272","Zephaniah 1-3",null,null,null,"Zephaniah 1-3",null,null,"Micah 4-7"]
["Day 273","Haggai 1-2",null,null,null,"Haggai 1-2",null,null,"Nahum 1-3"]
["Day 274","Zechariah 1-6",null,null,null,"Zechariah 1-6",null,null,"Habakkuk 1-3"]
["Day 275","Zechariah 7-10",null,null,null,"Zechariah 7-10",null,null,"Zephaniah 1-3"]
["Day 276","Zechariah 11-14",null,null,null,"Zechariah 11-14",null,null,"Haggai 1-2"]
["Day 277","Malachi 1-4",null,null,null,"Malachi 1-4",null,null,"Zechariah 1-3"]
["Day 278","Matthew 1-4",null,null,null,"Matthew 1-4",null,null,"Zechariah 4-6"]
["Day 279","Matthew 5-7",null,null,null,"Matthew 5-7",null,null,"Zechariah 7-10"]
["Day 280","Matthew 8-9",null,null,null,"Matthew 8-9",null,null,"Zechariah 11-14"]
["Day 281","Matthew 10-12",null,null,null,"Matthew 10-12",null,null,"Malachi 1-2"]
["Day 282","Matthew 13-14",null,null,null,"Matthew 13-14",null,null,"Malachi 3-4"]
["Day 283","Matthew 15-17",null,null,null,"Matthew 15-17",null,null,"Matthew 1-3"]
["Day 284","Matthew 18-20",null,null,null,"Matthew 18-20",null,null,"Matthew 4-6"]
["Day 285","Matthew 21-22",null,null,null,"Matthew 21-22",null,null,"Matthew 7-9"]
["Day 286","Matthew 23-24",null,null,null,"Matthew 23-24",null,null,"Matthew 10-12"]
["Day 287","Matthew 25-26",null,null,null,"Matthew 25-26",null,null,"Matthew 13-15"]
["Day 288","Matthew 27-28",null,null,null,"Matthew 27-28",null,null,"Matthew 16-18"]
["Day 289","Mark 1-3",null,null,null,"Mark 1-3",null,null,"Matthew 19-21"]
["Day 290","Mark 4-6",null,null,null,"Mark 4-6",null,null,"Matthew 22-24"]
["Day 291","Mark 7-9",null,null,null,"Mark 7-9",null,null,"Matthew 25-28"]
["Day 292","Mark 10-13",null,null,null,"Mark 10-13",null,null,"Mark 1-3"]
["Day 293","Mark 14-16",null,null,null,"Mark 14-16",null,null,"Mark 4-6"]
["Day 294","Luke 1",null,null,null,"Luke 1",null,null,"Mark 7-9"]
["Day 295","Luke 2-3",null,null,null,"Luke 2-3",null,null,"Mark 10-12"]
["Day 296","Luke 4-5",null,null,null,"Luke 4-5",null,null,"Mark 13-16"]
["Day 297","Luke 6-7",null,null,null,"Luke 6-7",null,null,"Luke 1-3"]
["Day 298","Luke 8-9",null,null,null,"Luke 8-9",null,null,"Luke 4-6"]
["Day 299","Luke 10-11",null,null,null,"Luke 10-11",null,null,"Luke 7-9"]
["Day 300","Luke 12-13",null,null,null,"Luke 12-13",null,null,"Luke 10-12"]
["Day 301","Luke 14-16",null,null,null,"Luke 14-16",null,null,"Luke 13-15"]
["Day 302","Luke 17-18",null,null,null,"Luke 17-18",null,null,"Luke 16-18"]
["Day 303","Luke 19-20",null,null,null,"Luke 19-20",null,null,"Luke 19-21"]
["Day 304","Luke 21-22",null,null,null,"Luke 21-22",null,null,"Luke 22-24"]
["Day 305","Luke 23-24",null,null,null,"Luke 23-24",null,null,"John 1-3"]
["Day 306","John 1-3",null,null,null,"John 1-3",null,null,"John 4-6"]
["Day 307","John 4-5",null,null,null,"John 4-5",null,null,"John 7-9"]
["Day 308","John 6-7",null,null,null,"John 6-7",null,null,"John 10-12"]
["Day 309","John 8-9",null,null,null,"John 8-9",null,null,"John 13-15"]
["Day 310","John 10-11",null,null,null,"John 10-11",null,null,"John 16-18"]
["Day 311","John 12-13",null,null,null,"John 12-13",null,null,"John 19-21"]
["Day 312","John 14-15",null,null,null,"John 14-15",null,null,"Acts 1-3"]
["Day 313","John 16-17",null,null,null,"John 16-17",null,null,"Acts 4-6"]
["Day 314","John 18-19",null,null,null,"John 18-19",null,null,"Acts 7-9"]
["Day 315","John 20-21",null,null,null,"John 20-21",null,null,"Acts 10-12"]
["Day 316","Acts 1-2",null,null,null,"Acts 1-2",null,null,"Acts 13-15"]
["Day 317","Acts 3-4",null,null,null,"Acts 3-4",null,null,"Acts 16-18"]
["Day 318","Acts 5-6",null,null,null,"Acts 5-6",null,null,"Acts 19-21"]
["Day 319","Acts 7-8",null,null,null,"Acts 7-8",null,null,"Acts 22-24"]
["Day 320","Acts 9-12",null,null,null,"Acts 9-12",null,null,"Acts 25-28"]
["Day 321","Acts 13-16",null,null,null,"Acts 13-16",null,null,"Romans 1-3"]
["Day 322","Acts 17-19",null,null,null,"Acts 17-19",null,null,"Romans 4-6"]
["Day 323","Acts 20-23",null,null,null,"Acts 20-23",null,null,"Romans 7-9"]
["Day 324","Acts 24-28",null,null,null,"Acts 24-28",null,null,"Romans 10-12"]
["Day 325","Romans 1-3",null,null,null,"Romans 1-3",null,null,"Romans 13-16"]
["Day 326","Romans 4-7",null,null,null,"Romans 4-7",null,null,"1 Corinthians 1-3"]
["Day 327","Romans 8-10",null,null,null,"Romans 8-10",null,null,"1 Corinthians 4-6"]
["Day 328","Romans 11-13",null,null,null,"Romans 11-13",null,null,"1 Corinthians 7-9"]
["Day 329","Romans 14-16",null,null,null,"Romans 14-16",null,null,"1 Corinthians 10-12"]
["Day 330","I Corinthians 1-4",null,null,null,"I Corinthians 1-4",null,null,"1 Corinthians 13-16"]
["Day 331","I Corinthians 5-9",null,null,null,"I Corinthians 5-9",null,null,"2 Corinthians 1-3"]
["Day 332","I Corinthians 10-13",null,null,null,"I Corinthians 10-13",null,null,"2 Corinthians 4-6"]
["Day 333","I Corinthians 14-16",null,null,null,"I Corinthians 14-16",null,null,"2 Corinthians 7-9"]
["Day 334","II Corinthians 1-4",null,null,null,"II Corinthians 1-4",null,null,"2 Corinthians 10-13"]
["Day 335","II Corinthians 5-7",null,null,null,"II Corinthians 5-7",null,null,"Galatians 1-3"]
["Day 336","II Corinthians 8-10",null,null,null,"II Corinthians 8-10",null,null,"Galatians 4-6"]
["Day 337","II Corinthians 11-13",null,null,null,"II Corinthians 11-13",null,null,"Ephesians 1-3"]
["Day 338","Galatians 1-3",null,null,null,"Galatians 1-3",null,null,"Ephesians 4-6"]
["Day 339","Galatians 4-6",null,null,null,"Galatians 4-6",null,null,"Philippians 1-4"]
["Day 340","Ephesians 1-3",null,null,null,"Ephesians 1-3",null,null,"Colossians 1-4"]
["Day 341","Ephesians 4-6",null,null,null,"Ephesians 4-6",null,null,"1 Thessalonians 1-5"]
["Day 342","Philippians 1-4",null,null,null,"Philippians 1-4",null,null,"2 Thessalonians 1-3"]
["Day 343","Colossians 1-4",null,null,null,"Colossians 1-4",null,null,"1 Timothy 1-3"]
["Day 344","I Thessalonians 1-3",null,null,null,"I Thessalonians 1-3",null,null,"1 Timothy 4-6"]
["Day 345","I Thessalonians 4-5",null,null,null,"I Thessalonians 4-5",null,null,"2 Timothy 1-4"]
["Day 346","II Thessalonians 1-3",null,null,null,"II Thessalonians 1-3",null,null,"Titus 1-3"]
["Day 347","I Timothy 1-6",null,null,null,"I Timothy 1-6",null,null,"Philemon"]
["Day 348","II Timothy 1-4",null,null,null,"II Timothy 1-4",null,null,"Hebrews 1-3"]
["Day 349","Titus & Philemon",null,null,null,"Titus & Philemon",null,null,"Hebrews 4-6"]
["Day 350","Hebrews 1-4",null,null,null,"Hebrews 1-4",null,null,"Hebrews 7-9"]
["Day 351","Hebrews 5-7",null,null,null,"Hebrews 5-7",null,null,"Hebrews 10-13"]
["Day 352","Hebrews 8-10",null,null,null,"Hebrews 8-10",null,null,"James 1-3"]
["Day 353","Hebrews 11-13",null,null,null,"Hebrews 11-13",null,null,"James 4-5"]
["Day 354","James 1-5",null,null,null,"James 1-5",null,null,"1 Peter 1-5"]
["Day 355","I Peter 1-5",null,null,null,"I Peter 1-5",null,null,"2 Peter 1-3"]
["Day 356","II Peter 1-3",null,null,null,"II Peter 1-3",null,null,"1 John 1-3"]
["Day 357","I John 1-5",null,null,null,"I John 1-5",null,null,"1 John 4-5"]
["Day 358","II John & III John",null,null,null,"II John & III John",null,null,"2 John, 3 John, and Jude"]
["Day 359","Jude",null,null,null,"Jude",null,null,"Revelation 1-3"]
["Day 360","Revelation 1-3",null,null,null,"Revelation 1-3",null,null,"Revelation 4-6"]
["Day 361","Revelation 4-7",null,null,null,"Revelation 4-7",null,null,"Revelation 7-9"]
["Day 362","Revelation 8-12",null,null,null,"Revelation 8-12",null,null,"Revelation 10-12"]
["Day 363","Revelation 13-16",null,null,null,"Revelation 13-16",null,null,"Revelation 13-15"]
["Day 364","Revelation 17-19",null,null,null,"Revelation 17-19",null,null,"Revelation 16-18"]
["Day 365","Revelation 20-22",null,null,null,"Revelation 20-22",null,null,"Revelation 19-22"]

{"sheet":"Template","index":3,"n_rows":369,"n_cols":8,"rows_kept":369,"cut":false,"hidden":false,"merged":[]}
[null,null,null,null,null,null,null,{"$f":"'Control Sheet'!K5","v":"Yes"}]
[null,null,null,null,null,null,null,{"$f":"'Control Sheet'!K15","v":"No"}]
[null,null,null,null,null,null,null,{"$f":"'Control Sheet'!K7","v":"No"}]
[null,"Day","Date","Day of Week","Today's Scripture Reading",null,"Date & Time Read"]
[null,null,"2012-01-01",{"$f":"INDEX(DayTable,WEEKDAY(C5))","v":"Sunday"}]
[null,null,{"$f":"C5+1","v":"2012-01-02"},"Monday"]
[null,null,{"$f":"C6+1","v":"2012-01-03"},"Tuesday"]
[null,null,"2012-01-04","Wednesday"]
[null,null,"2012-01-05","Thursday"]
[null,null,"2012-01-06","Friday"]
[null,null,"2012-01-07","Saturday"]
[null,null,"2012-01-08","Sunday"]
[null,null,"2012-01-09","Monday"]
[null,null,"2012-01-10","Tuesday"]
[null,null,"2012-01-11","Wednesday"]
[null,null,"2012-01-12","Thursday"]
[null,null,"2012-01-13","Friday"]
[null,null,"2012-01-14","Saturday"]
[null,null,"2012-01-15","Sunday"]
[null,null,"2012-01-16","Monday"]
[null,null,"2012-01-17","Tuesday"]
[null,null,"2012-01-18","Wednesday"]
[null,null,"2012-01-19","Thursday"]
[null,null,"2012-01-20","Friday"]
[null,null,"2012-01-21","Saturday"]
[null,null,"2012-01-22","Sunday"]
[null,null,"2012-01-23","Monday"]
[null,null,"2012-01-24","Tuesday"]
[null,null,"2012-01-25","Wednesday"]
[null,null,"2012-01-26","Thursday"]
[null,null,"2012-01-27","Friday"]
[null,null,"2012-01-28","Saturday"]
[null,null,"2012-01-29","Sunday"]
[null,null,"2012-01-30","Monday"]
[null,null,"2012-01-31","Tuesday"]
[null,null,"2012-02-01","Wednesday"]
[null,null,"2012-02-02","Thursday"]
[null,null,"2012-02-03","Friday"]
[null,null,"2012-02-04","Saturday"]
[null,null,"2012-02-05","Sunday"]
[null,null,"2012-02-06","Monday"]
[null,null,"2012-02-07","Tuesday"]
[null,null,"2012-02-08","Wednesday"]
[null,null,"2012-02-09","Thursday"]
[null,null,"2012-02-10","Friday"]
[null,null,"2012-02-11","Saturday"]
[null,null,"2012-02-12","Sunday"]
[null,null,"2012-02-13","Monday"]
[null,null,"2012-02-14","Tuesday"]
[null,null,"2012-02-15","Wednesday"]
[null,null,"2012-02-16","Thursday"]
[null,null,"2012-02-17","Friday"]
[null,null,"2012-02-18","Saturday"]
[null,null,"2012-02-19","Sunday"]
[null,null,"2012-02-20","Monday"]
[null,null,"2012-02-21","Tuesday"]
[null,null,"2012-02-22","Wednesday"]
[null,null,"2012-02-23","Thursday"]
[null,null,"2012-02-24","Friday"]
[null,null,"2012-02-25","Saturday"]
[null,null,"2012-02-26","Sunday"]
[null,null,"2012-02-27","Monday"]
[null,null,"2012-02-28","Tuesday"]
[null,null,"2012-03-01","Thursday"]
[null,null,"2012-03-02","Friday"]
[null,null,"2012-03-03","Saturday"]
[null,null,"2012-03-04","Sunday"]
[null,null,"2012-03-05","Monday"]
[null,null,"2012-03-06",{"$f":"INDEX(DayTable,WEEKDAY(C69))","v":"Tuesday"}]
[null,null,"2012-03-07","Wednesday"]
[null,null,{"$f":"C70+1","v":"2012-03-08"},"Thursday"]
[null,null,"2012-03-09","Friday"]
[null,null,"2012-03-10","Saturday"]
[null,null,"2012-03-11","Sunday"]
[null,null,"2012-03-12","Monday"]
[null,null,"2012-03-13","Tuesday"]
[null,null,"2012-03-14","Wednesday"]
[null,null,"2012-03-15","Thursday"]
[null,null,"2012-03-16","Friday"]
[null,null,"2012-03-17","Saturday"]
[null,null,"2012-03-18","Sunday"]
[null,null,"2012-03-19","Monday"]
[null,null,"2012-03-20","Tuesday"]
[null,null,"2012-03-21","Wednesday"]
[null,null,"2012-03-22","Thursday"]
[null,null,"2012-03-23","Friday"]
[null,null,"2012-03-24","Saturday"]
[null,null,"2012-03-25","Sunday"]
[null,null,"2012-03-26","Monday"]
[null,null,"2012-03-27","Tuesday"]
[null,null,"2012-03-28","Wednesday"]
[null,null,"2012-03-29","Thursday"]
[null,null,"2012-03-30","Friday"]
[null,null,"2012-03-31","Saturday"]
[null,null,"2012-04-01","Sunday"]
[null,null,"2012-04-02","Monday"]
[null,null,"2012-04-03","Tuesday"]
[null,null,"2012-04-04","Wednesday"]
[null,null,"2012-04-05","Thursday"]
[null,null,"2012-04-06","Friday"]
[null,null,"2012-04-07","Saturday"]
[null,null,"2012-04-08","Sunday"]
[null,null,"2012-04-09","Monday"]
[null,null,"2012-04-10","Tuesday"]
[null,null,"2012-04-11","Wednesday"]
[null,null,"2012-04-12","Thursday"]
[null,null,"2012-04-13","Friday"]
[null,null,"2012-04-14","Saturday"]
[null,null,"2012-04-15","Sunday"]
[null,null,"2012-04-16","Monday"]
[null,null,"2012-04-17","Tuesday"]
[null,null,"2012-04-18","Wednesday"]
[null,null,"2012-04-19","Thursday"]
[null,null,"2012-04-20","Friday"]
[null,null,"2012-04-21","Saturday"]
[null,null,"2012-04-22","Sunday"]
[null,null,"2012-04-23","Monday"]
[null,null,"2012-04-24","Tuesday"]
[null,null,"2012-04-25","Wednesday"]
[null,null,"2012-04-26","Thursday"]
[null,null,"2012-04-27","Friday"]
[null,null,"2012-04-28","Saturday"]
[null,null,"2012-04-29","Sunday"]
[null,null,"2012-04-30","Monday"]
[null,null,"2012-05-01","Tuesday"]
[null,null,"2012-05-02","Wednesday"]
[null,null,"2012-05-03","Thursday"]
[null,null,"2012-05-04","Friday"]
[null,null,"2012-05-05","Saturday"]
[null,null,"2012-05-06","Sunday"]
[null,null,"2012-05-07","Monday"]
[null,null,"2012-05-08","Tuesday"]
[null,null,"2012-05-09",{"$f":"INDEX(DayTable,WEEKDAY(C133))","v":"Wednesday"}]
[null,null,"2012-05-10","Thursday"]
[null,null,{"$f":"C134+1","v":"2012-05-11"},"Friday"]
[null,null,"2012-05-12","Saturday"]
[null,null,"2012-05-13","Sunday"]
[null,null,"2012-05-14","Monday"]
[null,null,"2012-05-15","Tuesday"]
[null,null,"2012-05-16","Wednesday"]
[null,null,"2012-05-17","Thursday"]
[null,null,"2012-05-18","Friday"]
[null,null,"2012-05-19","Saturday"]
[null,null,"2012-05-20","Sunday"]
[null,null,"2012-05-21","Monday"]
[null,null,"2012-05-22","Tuesday"]
[null,null,"2012-05-23","Wednesday"]
[null,null,"2012-05-24","Thursday"]
[null,null,"2012-05-25","Friday"]
[null,null,"2012-05-26","Saturday"]
[null,null,"2012-05-27","Sunday"]
[null,null,"2012-05-28","Monday"]
[null,null,"2012-05-29","Tuesday"]
[null,null,"2012-05-30","Wednesday"]
[null,null,"2012-05-31","Thursday"]
[null,null,"2012-06-01","Friday"]
[null,null,"2012-06-02","Saturday"]
[null,null,"2012-06-03","Sunday"]
[null,null,"2012-06-04","Monday"]
[null,null,"2012-06-05","Tuesday"]
[null,null,"2012-06-06","Wednesday"]
[null,null,"2012-06-07","Thursday"]
[null,null,"2012-06-08","Friday"]
[null,null,"2012-06-09","Saturday"]
[null,null,"2012-06-10","Sunday"]
[null,null,"2012-06-11","Monday"]
[null,null,"2012-06-12","Tuesday"]
[null,null,"2012-06-13","Wednesday"]
[null,null,"2012-06-14","Thursday"]
[null,null,"2012-06-15","Friday"]
[null,null,"2012-06-16","Saturday"]
[null,null,"2012-06-17","Sunday"]
[null,null,"2012-06-18","Monday"]
[null,null,"2012-06-19","Tuesday"]
[null,null,"2012-06-20","Wednesday"]
[null,null,"2012-06-21","Thursday"]
[null,null,"2012-06-22","Friday"]
[null,null,"2012-06-23","Saturday"]
[null,null,"2012-06-24","Sunday"]
[null,null,"2012-06-25","Monday"]
[null,null,"2012-06-26","Tuesday"]
[null,null,"2012-06-27","Wednesday"]
[null,null,"2012-06-28","Thursday"]
[null,null,"2012-06-29","Friday"]
[null,null,"2012-06-30","Saturday"]
[null,null,"2012-07-01","Sunday"]
[null,null,"2012-07-02","Monday"]
[null,null,"2012-07-03","Tuesday"]
[null,null,"2012-07-04","Wednesday"]
[null,null,"2012-07-05","Thursday"]
[null,null,"2012-07-06","Friday"]
[null,null,"2012-07-07","Saturday"]
[null,null,"2012-07-08","Sunday"]
[null,null,"2012-07-09","Monday"]
[null,null,"2012-07-10","Tuesday"]
[null,null,"2012-07-11","Wednesday"]
[null,null,"2012-07-12",{"$f":"INDEX(DayTable,WEEKDAY(C197))","v":"Thursday"}]
[null,null,"2012-07-13","Friday"]
[null,null,{"$f":"C198+1","v":"2012-07-14"},"Saturday"]
[null,null,"2012-07-15","Sunday"]
[null,null,"2012-07-16","Monday"]
[null,null,"2012-07-17","Tuesday"]
[null,null,"2012-07-18","Wednesday"]
[null,null,"2012-07-19","Thursday"]
[null,null,"2012-07-20","Friday"]
[null,null,"2012-07-21","Saturday"]
[null,null,"2012-07-22","Sunday"]
[null,null,"2012-07-23","Monday"]
[null,null,"2012-07-24","Tuesday"]
[null,null,"2012-07-25","Wednesday"]
[null,null,"2012-07-26","Thursday"]
[null,null,"2012-07-27","Friday"]
[null,null,"2012-07-28","Saturday"]
[null,null,"2012-07-29","Sunday"]
[null,null,"2012-07-30","Monday"]
[null,null,"2012-07-31","Tuesday"]
[null,null,"2012-08-01","Wednesday"]
[null,null,"2012-08-02","Thursday"]
[null,null,"2012-08-03","Friday"]
[null,null,"2012-08-04","Saturday"]
[null,null,"2012-08-05","Sunday"]
[null,null,"2012-08-06","Monday"]
[null,null,"2012-08-07","Tuesday"]
[null,null,"2012-08-08","Wednesday"]
[null,null,"2012-08-09","Thursday"]
[null,null,"2012-08-10","Friday"]
[null,null,"2012-08-11","Saturday"]
[null,null,"2012-08-12","Sunday"]
[null,null,"2012-08-13","Monday"]
[null,null,"2012-08-14","Tuesday"]
[null,null,"2012-08-15","Wednesday"]
[null,null,"2012-08-16","Thursday"]
[null,null,"2012-08-17","Friday"]
[null,null,"2012-08-18","Saturday"]
[null,null,"2012-08-19","Sunday"]
[null,null,"2012-08-20","Monday"]
[null,null,"2012-08-21","Tuesday"]
[null,null,"2012-08-22","Wednesday"]
[null,null,"2012-08-23","Thursday"]
[null,null,"2012-08-24","Friday"]
[null,null,"2012-08-25","Saturday"]
[null,null,"2012-08-26","Sunday"]
[null,null,"2012-08-27","Monday"]
[null,null,"2012-08-28","Tuesday"]
[null,null,"2012-08-29","Wednesday"]
[null,null,"2012-08-30","Thursday"]
[null,null,"2012-08-31","Friday"]
[null,null,"2012-09-01","Saturday"]
[null,null,"2012-09-02","Sunday"]
[null,null,"2012-09-03","Monday"]
[null,null,"2012-09-04","Tuesday"]
[null,null,"2012-09-05","Wednesday"]
[null,null,"2012-09-06","Thursday"]
[null,null,"2012-09-07","Friday"]
[null,null,"2012-09-08","Saturday"]
[null,null,"2012-09-09","Sunday"]
[null,null,"2012-09-10","Monday"]
[null,null,"2012-09-11","Tuesday"]
[null,null,"2012-09-12","Wednesday"]
[null,null,"2012-09-13","Thursday"]
[null,null,"2012-09-14",{"$f":"INDEX(DayTable,WEEKDAY(C261))","v":"Friday"}]
[null,null,"2012-09-15","Saturday"]
[null,null,{"$f":"C262+1","v":"2012-09-16"},"Sunday"]
[null,null,"2012-09-17","Monday"]
[null,null,"2012-09-18","Tuesday"]
[null,null,"2012-09-19","Wednesday"]
[null,null,"2012-09-20","Thursday"]
[null,null,"2012-09-21","Friday"]
[null,null,"2012-09-22","Saturday"]
[null,null,"2012-09-23","Sunday"]
[null,null,"2012-09-24","Monday"]
[null,null,"2012-09-25","Tuesday"]
[null,null,"2012-09-26","Wednesday"]
[null,null,"2012-09-27","Thursday"]
[null,null,"2012-09-28","Friday"]
[null,null,"2012-09-29","Saturday"]
[null,null,"2012-09-30","Sunday"]
[null,null,"2012-10-01","Monday"]
[null,null,"2012-10-02","Tuesday"]
[null,null,"2012-10-03","Wednesday"]
[null,null,"2012-10-04","Thursday"]
[null,null,"2012-10-05","Friday"]
[null,null,"2012-10-06","Saturday"]
[null,null,"2012-10-07","Sunday"]
[null,null,"2012-10-08","Monday"]
[null,null,"2012-10-09","Tuesday"]
[null,null,"2012-10-10","Wednesday"]
[null,null,"2012-10-11","Thursday"]
[null,null,"2012-10-12","Friday"]
[null,null,"2012-10-13","Saturday"]
[null,null,"2012-10-14","Sunday"]
[null,null,"2012-10-15","Monday"]
[null,null,"2012-10-16","Tuesday"]
[null,null,"2012-10-17","Wednesday"]
[null,null,"2012-10-18","Thursday"]
[null,null,"2012-10-19","Friday"]
[null,null,"2012-10-20","Saturday"]
[null,null,"2012-10-21","Sunday"]
[null,null,"2012-10-22","Monday"]
[null,null,"2012-10-23","Tuesday"]
[null,null,"2012-10-24","Wednesday"]
[null,null,"2012-10-25","Thursday"]
[null,null,"2012-10-26","Friday"]
[null,null,"2012-10-27","Saturday"]
[null,null,"2012-10-28","Sunday"]
[null,null,"2012-10-29","Monday"]
[null,null,"2012-10-30","Tuesday"]
[null,null,"2012-10-31","Wednesday"]
[null,null,"2012-11-01","Thursday"]
[null,null,"2012-11-02","Friday"]
[null,null,"2012-11-03","Saturday"]
[null,null,"2012-11-04","Sunday"]
[null,null,"2012-11-05","Monday"]
[null,null,"2012-11-06","Tuesday"]
[null,null,"2012-11-07","Wednesday"]
[null,null,"2012-11-08","Thursday"]
[null,null,"2012-11-09","Friday"]
[null,null,"2012-11-10","Saturday"]
[null,null,"2012-11-11","Sunday"]
[null,null,"2012-11-12","Monday"]
[null,null,"2012-11-13","Tuesday"]
[null,null,"2012-11-14","Wednesday"]
[null,null,"2012-11-15","Thursday"]
[null,null,"2012-11-16","Friday"]
[null,null,"2012-11-17",{"$f":"INDEX(DayTable,WEEKDAY(C325))","v":"Saturday"}]
[null,null,"2012-11-18","Sunday"]
[null,null,{"$f":"C326+1","v":"2012-11-19"},"Monday"]
[null,null,"2012-11-20","Tuesday"]
[null,null,"2012-11-21","Wednesday"]
[null,null,"2012-11-22","Thursday"]
[null,null,"2012-11-23","Friday"]
[null,null,"2012-11-24","Saturday"]
[null,null,"2012-11-25","Sunday"]
[null,null,"2012-11-26","Monday"]
[null,null,"2012-11-27","Tuesday"]
[null,null,"2012-11-28","Wednesday"]
[null,null,"2012-11-29","Thursday"]
[null,null,"2012-11-30","Friday"]
[null,null,"2012-12-01","Saturday"]
[null,null,"2012-12-02","Sunday"]
[null,null,"2012-12-03","Monday"]
[null,null,"2012-12-04","Tuesday"]
[null,null,"2012-12-05","Wednesday"]
[null,null,"2012-12-06","Thursday"]
[null,null,"2012-12-07","Friday"]
[null,null,"2012-12-08","Saturday"]
[null,null,"2012-12-09","Sunday"]
[null,null,"2012-12-10","Monday"]
[null,null,"2012-12-11","Tuesday"]
[null,null,"2012-12-12","Wednesday"]
[null,null,"2012-12-13","Thursday"]
[null,null,"2012-12-14","Friday"]
[null,null,"2012-12-15","Saturday"]
[null,null,"2012-12-16","Sunday"]
[null,null,"2012-12-17","Monday"]
[null,null,"2012-12-18","Tuesday"]
[null,null,"2012-12-19","Wednesday"]
[null,null,"2012-12-20","Thursday"]
[null,null,"2012-12-21","Friday"]
[null,null,"2012-12-22","Saturday"]
[null,null,"2012-12-23","Sunday"]
[null,null,"2012-12-24","Monday"]
[null,null,"2012-12-25","Tuesday"]
[null,null,"2012-12-26","Wednesday"]
[null,null,"2012-12-27","Thursday"]
[null,null,"2012-12-28","Friday"]
[null,null,"2012-12-29","Saturday"]
[null,null,"2012-12-30","Sunday"]
[null,null,"2012-12-31","Monday"]